Test failed with 1 exit code. See logs for more info
Info: Test run has exceeded 8.0G (8388608K) memory limit with 67.6G (70864584K) used. This may lead to test failure on the Autocheck/CI
You can increase test's ram requirement using REQUIREMENTS(ram:X) in the ya.make
pid rss ref pdirt
3343044 44.8M 44.8M 6.4M test_tool run_test @/home/runner/actions_runner/_work/ydb/ydb/tmp/out/ya_command_file_0.args
3343262 32.9M 21.1M 8.6M └─ test_tool run_test @/home/runner/actions_runner/_work/ydb/ydb/tmp/out/ya_command_file_0.args
3343267 263M 268M 215M └─ ydb-tests-stress-olap_workload-tests --basetemp /home/runner/actions_runner/_work/ydb/ydb/tmp/out/tmp --capture no -c pkg:library.python.pytest:pytest.yatest.ini -p no:f
3343410 8.4G 8.4G 8.2G ├─ ydbd server --suppress-version-check --yaml-config=/home/runner/actions_runner/_work/ydb/ydb/tmp/out/ydb/tests/stress/olap_workload/tests/test-results/py3test/testing
3343411 8.1G 8.1G 7.9G ├─ ydbd server --suppress-version-check --yaml-config=/home/runner/actions_runner/_work/ydb/ydb/tmp/out/ydb/tests/stress/olap_workload/tests/test-results/py3test/testing
3343412 8.1G 8.1G 7.9G ├─ ydbd server --suppress-version-check --yaml-config=/home/runner/actions_runner/_work/ydb/ydb/tmp/out/ydb/tests/stress/olap_workload/tests/test-results/py3test/testing
3343414 8.4G 8.5G 8.3G ├─ ydbd server --suppress-version-check --yaml-config=/home/runner/actions_runner/_work/ydb/ydb/tmp/out/ydb/tests/stress/olap_workload/tests/test-results/py3test/testing
3343416 8.3G 8.5G 8.3G ├─ ydbd server --suppress-version-check --yaml-config=/home/runner/actions_runner/_work/ydb/ydb/tmp/out/ydb/tests/stress/olap_workload/tests/test-results/py3test/testing
3343417 8.6G 8.7G 8.6G ├─ ydbd server --suppress-version-check --yaml-config=/home/runner/actions_runner/_work/ydb/ydb/tmp/out/ydb/tests/stress/olap_workload/tests/test-results/py3test/testing
3343418 8.2G 8.4G 8.3G ├─ ydbd server --suppress-version-check --yaml-config=/home/runner/actions_runner/_work/ydb/ydb/tmp/out/ydb/tests/stress/olap_workload/tests/test-results/py3test/testing
3343420 8.4G 8.4G 8.3G └─ ydbd server --suppress-version-check --yaml-config=/home/runner/actions_runner/_work/ydb/ydb/tmp/out/ydb/tests/stress/olap_workload/tests/test-results/py3test/testing
log:
/home/runner/actions_runner/_work/ydb/ydb/tmp/out/ydb/tests/stress/olap_workload/tests/test-results/py3test/run_test.log
logsdir:
/home/runner/actions_runner/_work/ydb/ydb/tmp/out/ydb/tests/stress/olap_workload/tests/test-results/py3test/testing_out_stuff
stderr:
/home/runner/actions_runner/_work/ydb/ydb/tmp/out/ydb/tests/stress/olap_workload/tests/test-results/py3test/testing_out_stuff/stderr
Status: passed
Date: 14:03 March 22 2025
SHA: 064d1ba9
Status: passed
Date: 18:03 March 22 2025
SHA: 19ace329
Test crashed (return code: -6)
See logs for more info
logsdir:
/home/runner/actions_runner/_work/ydb/ydb/tmp/out/ydb/core/kqp/ut/scheme/test-results/unittest/testing_out_stuff
stderr:
/home/runner/actions_runner/_work/ydb/ydb/tmp/out/ydb/core/kqp/ut/scheme/test-results/unittest/testing_out_stuff/KqpScheme.AlterTransfer.err
stdout:
/home/runner/actions_runner/_work/ydb/ydb/tmp/out/ydb/core/kqp/ut/scheme/test-results/unittest/testing_out_stuff/KqpScheme.AlterTransfer.out
Status: passed
Date: 20:03 March 21 2025
SHA: 82e9e8de
Status: passed
Date: 14:03 March 22 2025
SHA: 79a448f7
Status: mute
Date: 14:03 March 22 2025
Info: automatically muted based on rules
SHA: 064d1ba9
Status: mute
Date: 14:03 March 22 2025
Info: automatically muted based on rules
SHA: 064d1ba9
Status: passed
Date: 18:03 March 22 2025
SHA: 19ace329
ydb/tests/olap/ttl_tiering/ttl_delete_s3.py:415: in test_delete_s3_tiering
logger.info(f"Rows older than {self.days_to_freeze} days: {self.get_row_count_by_date(table_path, self.days_to_freeze)}")
ydb/tests/olap/ttl_tiering/ttl_delete_s3.py:31: in get_row_count_by_date
return self.ydb_client.query(f"SELECT count(*) as Rows from `{table_path}` WHERE ts < CurrentUtcTimestamp() - DateTime::IntervalFromDays({past_days})")[0].rows[0]["Rows"]
ydb/tests/olap/common/ydb_client.py:24: in query
return self.session_pool.execute_with_retries(statement)
contrib/python/ydb/py3/ydb/query/pool.py:202: in execute_with_retries
return retry_operation_sync(wrapped_callee, retry_settings)
contrib/python/ydb/py3/ydb/retries.py:133: in retry_operation_sync
for next_opt in opt_generator:
contrib/python/ydb/py3/ydb/retries.py:94: in retry_operation_impl
result = YdbRetryOperationFinalResult(callee(*args, **kwargs))
contrib/python/ydb/py3/ydb/query/pool.py:200: in wrapped_callee
return [result_set for result_set in it]
contrib/python/ydb/py3/ydb/_utilities.py:173: in __next__
return self._next()
contrib/python/ydb/py3/ydb/_utilities.py:164: in _next
res = self.wrapper(next(self.it))
contrib/python/grpcio/py3/grpc/_channel.py:475: in __next__
return self._next()
contrib/python/grpcio/py3/grpc/_channel.py:881: in _next
raise self
E grpc._channel._MultiThreadedRendezvous: <_MultiThreadedRendezvous of RPC that terminated with:
E status = StatusCode.UNAVAILABLE
E details = "Socket closed"
E debug_error_string = "UNKNOWN:Error received from peer {file:"/home/runner/actions_runner/_work/ydb/ydb/contrib/libs/grpc/src/core/lib/surface/call.cc", file_line:1211, created_time:"2025-03-22T19:00:28.490730578+00:00", grpc_status:14, grpc_message:"Socket closed"}"
E >teardown failed:
ydb/tests/olap/ttl_tiering/base.py:25: in teardown_class
cls.cluster.stop()
ydb/tests/library/harness/kikimr_runner.py:494: in stop
raise daemon.SeveralDaemonErrors(saved_exceptions)
E ydb.tests.library.harness.daemon.SeveralDaemonErrors: Daemon failed with message: Unexpectedly finished before stop.
E Process exit_code = -6.
E Stdout file name:
E /home/runner/actions_runner/_work/ydb/ydb/tmp/out/ydb/tests/olap/ttl_tiering/test-results/py3test/testing_out_stuff/ttl_delete_s3.py.TestDeleteS3Ttl.test_data_unchanged_after_ttl_change/cluster/node_1/stdout
E Stderr file name:
E /home/runner/actions_runner/_work/ydb/ydb/tmp/out/ydb/tests/olap/ttl_tiering/test-results/py3test/testing_out_stuff/ttl_delete_s3.py.TestDeleteS3Ttl.test_data_unchanged_after_ttl_change/cluster/node_1/stderr
E Stderr content:
E
E GRpc memory quota was set but disabled due to issues with grpc quoter, to enable it use EnableGRpcMemoryQuota option
E VERIFY failed (2025-03-22T19:00:26.257402Z): verification=(ui32)result->num_columns() == columnNames.size();fline=process_columns.cpp:106;schema=ts: timestamp[us];required=_yql_plan_step,_yql_tx_id,_yql_write_id;
E ydb/library/actors/core/log.cpp:754
E ~TVerifyFormattedRecordWriter(): requirement false failed
E 0. /-S/util/system/yassert.cpp:83: InternalPanicImpl @ 0xA123875
E 1. /-S/util/system/yassert.cpp:55: Panic @ 0xA11C0C6
E 2. /tmp//-S/ydb/library/actors/core/log.cpp:754: ~TVerifyFormattedRecordWriter @ 0xAE938F3
E 3. /tmp//-S/ydb/core/formats/arrow/process_columns.cpp:106: ExtractImpl<arrow::Table, TBasicString<char, std::__y1::char_traits<char> > > @ 0xD25BE33
E 4. /tmp//-S/ydb/core/formats/arrow/process_columns.cpp:188: Extract @ 0xD25BE33
E 5. /tmp//-S/ydb/core/tx/columnshard/engines/reader/plain_reader/iterator/merge.cpp:107: DoExecuteImpl @ 0x143788FE
E 6. /tmp//-S/ydb/core/tx/columnshard/engines/reader/common/conveyor_task.cpp:8: DoExecute @ 0x143C5B90
E 7. /tmp//-S/ydb/core/tx/conveyor/usage/abstract.cpp:16: Execute @ 0x1433470F
E 8. /tmp//-S/ydb/core/tx/conveyor/service/worker.cpp:11: ExecuteTask @ 0x1ABE468D
E 9. /tmp//-S/ydb/core/tx/conveyor/service/worker.cpp:47: HandleMain @ 0x1ABE5B1B
E 10. /tmp//-S/ydb/library/actors/core/actor.cpp:280: Receive @ 0xAE4D974
E 11. /tmp//-S/ydb/library/actors/core/executor_thread.cpp:269: Execute @ 0xAE8537B
E 12. /tmp//-S/ydb/library/actors/core/executor_thread.cpp:460: operator() @ 0xAE89052
E 13. /tmp//-S/ydb/library/actors/core/executor_thread.cpp:512: ProcessExecutorPool @ 0xAE88C20
E 14. /tmp//-S/ydb/library/actors/core/executor_thread.cpp:538: ThreadProc @ 0xAE8988A
E 15. /-S/util/system/thread.cpp:244: ThreadProxy @ 0xA124CDC
E 16. ??:0: ?? @ 0x7F8631634AC2
E 17. ??:0: ?? @ 0x7F86316C684F
logsdir:
/home/runner/actions_runner/_work/ydb/ydb/tmp/out/ydb/tests/olap/ttl_tiering/test-results/py3test/testing_out_stuff
log:
/home/runner/actions_runner/_work/ydb/ydb/tmp/out/ydb/tests/olap/ttl_tiering/test-results/py3test/testing_out_stuff/ttl_delete_s3.py.TestDeleteS3Ttl.test_delete_s3_tiering.log
Status: passed
Date: 20:03 March 21 2025
SHA: 82e9e8de
Status: mute
Date: 14:03 March 22 2025
Info: automatically muted based on rules
SHA: 79a448f7
Status: mute
Date: 14:03 March 22 2025
Info: automatically muted based on rules
SHA: 064d1ba9
Status: mute
Date: 14:03 March 22 2025
Info: automatically muted based on rules
SHA: 79a448f7
Status: passed
Date: 14:03 March 22 2025
SHA: 064d1ba9
Chunk exceeded 600s timeout and was killed
List of the tests involved in the launch:
test_quota_exhaustion.py::TestYdbWorkload::test_delete (timeout) duration: 622.10s
log:
/home/runner/actions_runner/_work/ydb/ydb/tmp/out/ydb/tests/olap/test-results/py3test/run_test.log
logsdir:
/home/runner/actions_runner/_work/ydb/ydb/tmp/out/ydb/tests/olap/test-results/py3test/testing_out_stuff
stderr:
/home/runner/actions_runner/_work/ydb/ydb/tmp/out/ydb/tests/olap/test-results/py3test/testing_out_stuff/stderr
Status: mute
Date: 14:03 March 22 2025
Info: automatically muted based on rules
SHA: 064d1ba9
Status: mute
Date: 14:03 March 22 2025
Info: automatically muted based on rules
SHA: 79a448f7
Status: passed
Date: 18:03 March 22 2025
SHA: 19ace329
equal assertion failed at ydb/core/keyvalue/keyvalue_ut_trace.cpp:124, void TestOneRead(TString, TString): env.WilsonUploader->Traces.size() == 1
TBackTrace::Capture() at /-S/util/system/backtrace.cpp:284:14
Get at /-S/util/generic/ptr.h:579:16
UnRef at /-S/util/generic/ptr.h:624:13
UnRef at /-S/util/generic/ptr.h:624:13
NTestSuiteTKeyValueTracingTest::TCurrentTest::Execute()::'lambda'()::operator()() const at /-S/ydb/core/keyvalue/keyvalue_ut_trace.cpp:0:1
~__value_func at /-S/contrib/libs/cxxsupp/libcxx/include/__functional/function.h:397:16
UnRef at /-S/util/generic/ptr.h:624:13
NUnitTest::TTestFactory::Execute() at /-S/library/cpp/testing/unittest/registar.cpp:0:19
NUnitTest::RunMain(int, char**) at /-S/library/cpp/testing/unittest/utmain.cpp:0:0
?? at ??:0:0
?? at ??:0:0
_start at ??:0:0
logsdir:
/home/runner/actions_runner/_work/ydb/ydb/tmp/out/ydb/core/keyvalue/ut_trace/test-results/unittest/testing_out_stuff
stderr:
/home/runner/actions_runner/_work/ydb/ydb/tmp/out/ydb/core/keyvalue/ut_trace/test-results/unittest/testing_out_stuff/TKeyValueTracingTest.ReadHuge.err
stdout:
/home/runner/actions_runner/_work/ydb/ydb/tmp/out/ydb/core/keyvalue/ut_trace/test-results/unittest/testing_out_stuff/TKeyValueTracingTest.ReadHuge.out
Status: mute
Date: 14:03 March 22 2025
Info: automatically muted based on rules
SHA: 064d1ba9
Status: mute
Date: 14:03 March 22 2025
Info: automatically muted based on rules
SHA: 79a448f7
Status: mute
Date: 14:03 March 22 2025
Info: automatically muted based on rules
SHA: 064d1ba9
Status: mute
Date: 18:03 March 22 2025
Info: automatically muted based on rules
SHA: 19ace329
Status: mute
Date: 18:03 March 22 2025
Info: automatically muted based on rules
SHA: 19ace329
equal assertion failed at ydb/core/keyvalue/keyvalue_ut_trace.cpp:124, void TestOneRead(TString, TString): env.WilsonUploader->Traces.size() == 1
TBackTrace::Capture() at /-S/util/system/backtrace.cpp:284:14
Get at /-S/util/generic/ptr.h:579:16
UnRef at /-S/util/generic/ptr.h:624:13
UnRef at /-S/util/generic/ptr.h:624:13
NTestSuiteTKeyValueTracingTest::TCurrentTest::Execute()::'lambda'()::operator()() const at /-S/ydb/core/keyvalue/keyvalue_ut_trace.cpp:0:1
~__value_func at /-S/contrib/libs/cxxsupp/libcxx/include/__functional/function.h:397:16
UnRef at /-S/util/generic/ptr.h:624:13
NUnitTest::TTestFactory::Execute() at /-S/library/cpp/testing/unittest/registar.cpp:0:19
NUnitTest::RunMain(int, char**) at /-S/library/cpp/testing/unittest/utmain.cpp:0:0
?? at ??:0:0
?? at ??:0:0
_start at ??:0:0
logsdir:
/home/runner/actions_runner/_work/ydb/ydb/tmp/out/ydb/core/keyvalue/ut_trace/test-results/unittest/testing_out_stuff
stderr:
/home/runner/actions_runner/_work/ydb/ydb/tmp/out/ydb/core/keyvalue/ut_trace/test-results/unittest/testing_out_stuff/TKeyValueTracingTest.ReadSmall.err
stdout:
/home/runner/actions_runner/_work/ydb/ydb/tmp/out/ydb/core/keyvalue/ut_trace/test-results/unittest/testing_out_stuff/TKeyValueTracingTest.ReadSmall.out
Status: mute
Date: 14:03 March 22 2025
Info: automatically muted based on rules
SHA: 064d1ba9
Status: mute
Date: 14:03 March 22 2025
Info: automatically muted based on rules
SHA: 79a448f7
Status: mute
Date: 14:03 March 22 2025
Info: automatically muted based on rules
SHA: 064d1ba9
Status: mute
Date: 18:03 March 22 2025
Info: automatically muted based on rules
SHA: 19ace329
Status: mute
Date: 18:03 March 22 2025
Info: automatically muted based on rules
SHA: 19ace329
assertion failed at ydb/core/keyvalue/keyvalue_ut_trace.cpp:103, void TestOneWrite(TString, TVector<TString> &&): (env.WilsonUploader->Traces.size() == 1) failed: (2 != 1)
TBackTrace::Capture() at /-S/util/system/backtrace.cpp:284:14
Get at /-S/util/generic/ptr.h:579:16
~TStringBuilder at /-S/util/string/builder.h:8:11
UnRef at /-S/util/generic/ptr.h:624:13
NTestSuiteTKeyValueTracingTest::TCurrentTest::Execute()::'lambda'()::operator()() const at /-S/ydb/core/keyvalue/keyvalue_ut_trace.cpp:0:1
~__value_func at /-S/contrib/libs/cxxsupp/libcxx/include/__functional/function.h:397:16
UnRef at /-S/util/generic/ptr.h:624:13
NUnitTest::TTestFactory::Execute() at /-S/library/cpp/testing/unittest/registar.cpp:0:19
NUnitTest::RunMain(int, char**) at /-S/library/cpp/testing/unittest/utmain.cpp:0:0
?? at ??:0:0
?? at ??:0:0
_start at ??:0:0
logsdir:
/home/runner/actions_runner/_work/ydb/ydb/tmp/out/ydb/core/keyvalue/ut_trace/test-results/unittest/testing_out_stuff
stderr:
/home/runner/actions_runner/_work/ydb/ydb/tmp/out/ydb/core/keyvalue/ut_trace/test-results/unittest/testing_out_stuff/TKeyValueTracingTest.WriteHuge.err
stdout:
/home/runner/actions_runner/_work/ydb/ydb/tmp/out/ydb/core/keyvalue/ut_trace/test-results/unittest/testing_out_stuff/TKeyValueTracingTest.WriteHuge.out
Status: mute
Date: 14:03 March 22 2025
Info: automatically muted based on rules
SHA: 064d1ba9
Status: mute
Date: 14:03 March 22 2025
Info: automatically muted based on rules
SHA: 79a448f7
Status: mute
Date: 14:03 March 22 2025
Info: automatically muted based on rules
SHA: 064d1ba9
Status: mute
Date: 18:03 March 22 2025
Info: automatically muted based on rules
SHA: 19ace329
Status: mute
Date: 18:03 March 22 2025
Info: automatically muted based on rules
SHA: 19ace329
assertion failed at ydb/core/keyvalue/keyvalue_ut_trace.cpp:103, void TestOneWrite(TString, TVector<TString> &&): (env.WilsonUploader->Traces.size() == 1) failed: (2 != 1)
TBackTrace::Capture() at /-S/util/system/backtrace.cpp:284:14
Get at /-S/util/generic/ptr.h:579:16
~TStringBuilder at /-S/util/string/builder.h:8:11
UnRef at /-S/util/generic/ptr.h:624:13
NTestSuiteTKeyValueTracingTest::TCurrentTest::Execute()::'lambda'()::operator()() const at /-S/ydb/core/keyvalue/keyvalue_ut_trace.cpp:0:1
~__value_func at /-S/contrib/libs/cxxsupp/libcxx/include/__functional/function.h:397:16
UnRef at /-S/util/generic/ptr.h:624:13
NUnitTest::TTestFactory::Execute() at /-S/library/cpp/testing/unittest/registar.cpp:0:19
NUnitTest::RunMain(int, char**) at /-S/library/cpp/testing/unittest/utmain.cpp:0:0
?? at ??:0:0
?? at ??:0:0
_start at ??:0:0
logsdir:
/home/runner/actions_runner/_work/ydb/ydb/tmp/out/ydb/core/keyvalue/ut_trace/test-results/unittest/testing_out_stuff
stderr:
/home/runner/actions_runner/_work/ydb/ydb/tmp/out/ydb/core/keyvalue/ut_trace/test-results/unittest/testing_out_stuff/TKeyValueTracingTest.WriteSmall.err
stdout:
/home/runner/actions_runner/_work/ydb/ydb/tmp/out/ydb/core/keyvalue/ut_trace/test-results/unittest/testing_out_stuff/TKeyValueTracingTest.WriteSmall.out
Status: mute
Date: 14:03 March 22 2025
Info: automatically muted based on rules
SHA: 064d1ba9
Status: mute
Date: 14:03 March 22 2025
Info: automatically muted based on rules
SHA: 79a448f7
Status: mute
Date: 14:03 March 22 2025
Info: automatically muted based on rules
SHA: 064d1ba9
Status: mute
Date: 18:03 March 22 2025
Info: automatically muted based on rules
SHA: 19ace329
Status: mute
Date: 18:03 March 22 2025
Info: automatically muted based on rules
SHA: 19ace329
Status: mute
Date: 14:03 March 22 2025
Info: automatically muted based on rules
SHA: 064d1ba9
Status: mute
Date: 14:03 March 22 2025
Info: automatically muted based on rules
SHA: 79a448f7
Status: mute
Date: 14:03 March 22 2025
Info: automatically muted based on rules
SHA: 064d1ba9
Status: mute
Date: 18:03 March 22 2025
Info: automatically muted based on rules
SHA: 19ace329
Status: mute
Date: 18:03 March 22 2025
Info: automatically muted based on rules
SHA: 19ace329
Test crashed (return code: -11)
See logs for more info
logsdir:
/home/runner/actions_runner/_work/ydb/ydb/tmp/out/ydb/core/kqp/ut/olap/test-results/unittest/testing_out_stuff
stderr:
/home/runner/actions_runner/_work/ydb/ydb/tmp/out/ydb/core/kqp/ut/olap/test-results/unittest/testing_out_stuff/KqpDecimalColumnShard.TestAggregation.err
stdout:
/home/runner/actions_runner/_work/ydb/ydb/tmp/out/ydb/core/kqp/ut/olap/test-results/unittest/testing_out_stuff/KqpDecimalColumnShard.TestAggregation.out
Status: mute
Date: 14:03 March 22 2025
Info: automatically muted based on rules
SHA: 064d1ba9
Status: mute
Date: 14:03 March 22 2025
Info: automatically muted based on rules
SHA: 79a448f7
Status: mute
Date: 14:03 March 22 2025
Info: automatically muted based on rules
SHA: 064d1ba9
Status: mute
Date: 18:03 March 22 2025
Info: automatically muted based on rules
SHA: 19ace329
Status: mute
Date: 18:03 March 22 2025
Info: automatically muted based on rules
SHA: 19ace329
Status: mute
Date: 14:03 March 22 2025
Info: automatically muted based on rules
SHA: 064d1ba9
Status: mute
Date: 14:03 March 22 2025
Info: automatically muted based on rules
SHA: 79a448f7
Status: mute
Date: 14:03 March 22 2025
Info: automatically muted based on rules
SHA: 064d1ba9
Status: mute
Date: 18:03 March 22 2025
Info: automatically muted based on rules
SHA: 19ace329
Status: mute
Date: 18:03 March 22 2025
Info: automatically muted based on rules
SHA: 19ace329
Test crashed (return code: -6)
See logs for more info
logsdir:
/home/runner/actions_runner/_work/ydb/ydb/tmp/out/ydb/core/kqp/ut/olap/test-results/unittest/testing_out_stuff
stderr:
/home/runner/actions_runner/_work/ydb/ydb/tmp/out/ydb/core/kqp/ut/olap/test-results/unittest/testing_out_stuff/KqpOlapSysView.StatsSysViewBytesDictActualization.err
stdout:
/home/runner/actions_runner/_work/ydb/ydb/tmp/out/ydb/core/kqp/ut/olap/test-results/unittest/testing_out_stuff/KqpOlapSysView.StatsSysViewBytesDictActualization.out
Status: mute
Date: 14:03 March 22 2025
Info: automatically muted based on rules
SHA: 064d1ba9
Status: mute
Date: 14:03 March 22 2025
Info: automatically muted based on rules
SHA: 79a448f7
Status: mute
Date: 14:03 March 22 2025
Info: automatically muted based on rules
SHA: 064d1ba9
Status: mute
Date: 18:03 March 22 2025
Info: automatically muted based on rules
SHA: 19ace329
Status: mute
Date: 18:03 March 22 2025
Info: automatically muted based on rules
SHA: 19ace329
Test crashed (return code: -6)
See logs for more info
logsdir:
/home/runner/actions_runner/_work/ydb/ydb/tmp/out/ydb/core/kqp/ut/olap/test-results/unittest/testing_out_stuff
stderr:
/home/runner/actions_runner/_work/ydb/ydb/tmp/out/ydb/core/kqp/ut/olap/test-results/unittest/testing_out_stuff/KqpOlapSysView.StatsSysViewBytesDictStatActualization.err
stdout:
/home/runner/actions_runner/_work/ydb/ydb/tmp/out/ydb/core/kqp/ut/olap/test-results/unittest/testing_out_stuff/KqpOlapSysView.StatsSysViewBytesDictStatActualization.out
Status: mute
Date: 14:03 March 22 2025
Info: automatically muted based on rules
SHA: 064d1ba9
Status: mute
Date: 14:03 March 22 2025
Info: automatically muted based on rules
SHA: 79a448f7
Status: mute
Date: 14:03 March 22 2025
Info: automatically muted based on rules
SHA: 064d1ba9
Status: mute
Date: 18:03 March 22 2025
Info: automatically muted based on rules
SHA: 19ace329
Status: mute
Date: 18:03 March 22 2025
Info: automatically muted based on rules
SHA: 19ace329
Status: mute
Date: 20:03 March 21 2025
Info: automatically muted based on rules
SHA: 82e9e8de
Status: mute
Date: 14:03 March 22 2025
Info: automatically muted based on rules
SHA: 79a448f7
Status: mute
Date: 14:03 March 22 2025
Info: automatically muted based on rules
SHA: 064d1ba9
Status: mute
Date: 14:03 March 22 2025
Info: automatically muted based on rules
SHA: 79a448f7
Status: mute
Date: 14:03 March 22 2025
Info: automatically muted based on rules
SHA: 064d1ba9
Status: mute
Date: 20:03 March 21 2025
Info: automatically muted based on rules
SHA: 82e9e8de
Status: mute
Date: 14:03 March 22 2025
Info: automatically muted based on rules
SHA: 79a448f7
Status: mute
Date: 14:03 March 22 2025
Info: automatically muted based on rules
SHA: 064d1ba9
Status: mute
Date: 14:03 March 22 2025
Info: automatically muted based on rules
SHA: 79a448f7
Status: mute
Date: 14:03 March 22 2025
Info: automatically muted based on rules
SHA: 064d1ba9
Status: mute
Date: 20:03 March 21 2025
Info: automatically muted based on rules
SHA: 82e9e8de
Status: mute
Date: 14:03 March 22 2025
Info: automatically muted based on rules
SHA: 79a448f7
Status: mute
Date: 14:03 March 22 2025
Info: automatically muted based on rules
SHA: 064d1ba9
Status: mute
Date: 14:03 March 22 2025
Info: automatically muted based on rules
SHA: 79a448f7
Status: mute
Date: 14:03 March 22 2025
Info: automatically muted based on rules
SHA: 064d1ba9
Status: mute
Date: 14:03 March 22 2025
Info: automatically muted based on rules
SHA: 064d1ba9
Status: mute
Date: 14:03 March 22 2025
Info: automatically muted based on rules
SHA: 79a448f7
Status: mute
Date: 14:03 March 22 2025
Info: automatically muted based on rules
SHA: 064d1ba9
Status: mute
Date: 18:03 March 22 2025
Info: automatically muted based on rules
SHA: 19ace329
Status: mute
Date: 18:03 March 22 2025
Info: automatically muted based on rules
SHA: 19ace329
Status: mute
Date: 14:03 March 22 2025
Info: automatically muted based on rules
SHA: 064d1ba9
Status: mute
Date: 14:03 March 22 2025
Info: automatically muted based on rules
SHA: 79a448f7
Status: mute
Date: 14:03 March 22 2025
Info: automatically muted based on rules
SHA: 064d1ba9
Status: mute
Date: 18:03 March 22 2025
Info: automatically muted based on rules
SHA: 19ace329
Status: mute
Date: 18:03 March 22 2025
Info: automatically muted based on rules
SHA: 19ace329
Status: mute
Date: 14:03 March 22 2025
Info: automatically muted based on rules
SHA: 064d1ba9
Status: mute
Date: 14:03 March 22 2025
Info: automatically muted based on rules
SHA: 79a448f7
Status: mute
Date: 14:03 March 22 2025
Info: automatically muted based on rules
SHA: 064d1ba9
Status: mute
Date: 18:03 March 22 2025
Info: automatically muted based on rules
SHA: 19ace329
Status: mute
Date: 18:03 March 22 2025
Info: automatically muted based on rules
SHA: 19ace329
Status: mute
Date: 14:03 March 22 2025
Info: automatically muted based on rules
SHA: 064d1ba9
Status: mute
Date: 14:03 March 22 2025
Info: automatically muted based on rules
SHA: 79a448f7
Status: mute
Date: 14:03 March 22 2025
Info: automatically muted based on rules
SHA: 064d1ba9
Status: mute
Date: 18:03 March 22 2025
Info: automatically muted based on rules
SHA: 19ace329
Status: mute
Date: 18:03 March 22 2025
Info: automatically muted based on rules
SHA: 19ace329
Status: mute
Date: 14:03 March 22 2025
Info: automatically muted based on rules
SHA: 064d1ba9
Status: mute
Date: 14:03 March 22 2025
Info: automatically muted based on rules
SHA: 79a448f7
Status: mute
Date: 14:03 March 22 2025
Info: automatically muted based on rules
SHA: 064d1ba9
Status: mute
Date: 18:03 March 22 2025
Info: automatically muted based on rules
SHA: 19ace329
Status: mute
Date: 18:03 March 22 2025
Info: automatically muted based on rules
SHA: 19ace329
Status: mute
Date: 14:03 March 22 2025
Info: automatically muted based on rules
SHA: 064d1ba9
Status: mute
Date: 14:03 March 22 2025
Info: automatically muted based on rules
SHA: 79a448f7
Status: mute
Date: 14:03 March 22 2025
Info: automatically muted based on rules
SHA: 064d1ba9
Status: mute
Date: 18:03 March 22 2025
Info: automatically muted based on rules
SHA: 19ace329
Status: mute
Date: 18:03 March 22 2025
Info: automatically muted based on rules
SHA: 19ace329
Status: mute
Date: 14:03 March 22 2025
Info: automatically muted based on rules
SHA: 064d1ba9
Status: mute
Date: 14:03 March 22 2025
Info: automatically muted based on rules
SHA: 79a448f7
Status: mute
Date: 14:03 March 22 2025
Info: automatically muted based on rules
SHA: 064d1ba9
Status: mute
Date: 18:03 March 22 2025
Info: automatically muted based on rules
SHA: 19ace329
Status: mute
Date: 18:03 March 22 2025
Info: automatically muted based on rules
SHA: 19ace329
Status: mute
Date: 14:03 March 22 2025
Info: automatically muted based on rules
SHA: 064d1ba9
Status: mute
Date: 14:03 March 22 2025
Info: automatically muted based on rules
SHA: 79a448f7
Status: mute
Date: 14:03 March 22 2025
Info: automatically muted based on rules
SHA: 064d1ba9
Status: mute
Date: 18:03 March 22 2025
Info: automatically muted based on rules
SHA: 19ace329
Status: mute
Date: 18:03 March 22 2025
Info: automatically muted based on rules
SHA: 19ace329
Status: mute
Date: 14:03 March 22 2025
Info: automatically muted based on rules
SHA: 064d1ba9
Status: mute
Date: 14:03 March 22 2025
Info: automatically muted based on rules
SHA: 79a448f7
Status: mute
Date: 14:03 March 22 2025
Info: automatically muted based on rules
SHA: 064d1ba9
Status: mute
Date: 18:03 March 22 2025
Info: automatically muted based on rules
SHA: 19ace329
Status: mute
Date: 18:03 March 22 2025
Info: automatically muted based on rules
SHA: 19ace329
Status: mute
Date: 14:03 March 22 2025
Info: automatically muted based on rules
SHA: 064d1ba9
Status: mute
Date: 14:03 March 22 2025
Info: automatically muted based on rules
SHA: 79a448f7
Status: mute
Date: 14:03 March 22 2025
Info: automatically muted based on rules
SHA: 064d1ba9
Status: mute
Date: 18:03 March 22 2025
Info: automatically muted based on rules
SHA: 19ace329
Status: mute
Date: 18:03 March 22 2025
Info: automatically muted based on rules
SHA: 19ace329
Status: mute
Date: 14:03 March 22 2025
Info: automatically muted based on rules
SHA: 064d1ba9
Status: mute
Date: 14:03 March 22 2025
Info: automatically muted based on rules
SHA: 79a448f7
Status: mute
Date: 14:03 March 22 2025
Info: automatically muted based on rules
SHA: 064d1ba9
Status: mute
Date: 18:03 March 22 2025
Info: automatically muted based on rules
SHA: 19ace329
Status: mute
Date: 18:03 March 22 2025
Info: automatically muted based on rules
SHA: 19ace329
Status: mute
Date: 14:03 March 22 2025
Info: automatically muted based on rules
SHA: 064d1ba9
Status: mute
Date: 14:03 March 22 2025
Info: automatically muted based on rules
SHA: 79a448f7
Status: mute
Date: 14:03 March 22 2025
Info: automatically muted based on rules
SHA: 064d1ba9
Status: mute
Date: 18:03 March 22 2025
Info: automatically muted based on rules
SHA: 19ace329
Status: mute
Date: 18:03 March 22 2025
Info: automatically muted based on rules
SHA: 19ace329
Status: mute
Date: 14:03 March 22 2025
Info: automatically muted based on rules
SHA: 064d1ba9
Status: mute
Date: 14:03 March 22 2025
Info: automatically muted based on rules
SHA: 79a448f7
Status: mute
Date: 14:03 March 22 2025
Info: automatically muted based on rules
SHA: 064d1ba9
Status: mute
Date: 18:03 March 22 2025
Info: automatically muted based on rules
SHA: 19ace329
Status: mute
Date: 18:03 March 22 2025
Info: automatically muted based on rules
SHA: 19ace329
(TWithBackTrace<yexception>) ydb/library/actors/testlib/test_runtime.h:579: Exception occured while waiting for NKikimr::NStat::TEvStatistics::TEvAnalyzeResponse: (NActors::TSchedulingLimitReachedException) TestActorRuntime Processed over 100000 events.ydb/library/actors/testlib/test_runtime.cpp:716:
TBackTrace::Capture() at /-S/util/system/backtrace.cpp:284:14
TWithBackTrace<yexception>::TWithBackTrace<>() at /-S/util/generic/bt_exception.h:16:5
NKikimr::NStat::TEvStatistics::TEvAnalyzeResponse::TPtr NActors::TTestActorRuntimeBase::GrabEdgeEventRethrow<NKikimr::NStat::TEvStatistics::TEvAnalyzeResponse>(NActors::TActorId const&, TDuration) at /-S/ydb/library/actors/testlib/test_runtime.h:0:24
DoDestroy at /-S/util/generic/ptr.h:237:13
NKikimr::NStat::NTestSuiteAnalyzeColumnshard::TCurrentTest::Execute()::'lambda'()::operator()() const at /-S/ydb/core/statistics/aggregator/ut/ut_analyze_columnshard.cpp:0:1
~__value_func at /-S/contrib/libs/cxxsupp/libcxx/include/__functional/function.h:397:16
UnRef at /-S/util/generic/ptr.h:624:13
NUnitTest::TTestFactory::Execute() at /-S/library/cpp/testing/unittest/registar.cpp:0:19
NUnitTest::RunMain(int, char**) at /-S/library/cpp/testing/unittest/utmain.cpp:0:0
?? at ??:0:0
?? at ??:0:0
_start at ??:0:0
logsdir:
/home/runner/actions_runner/_work/ydb/ydb/tmp/out/ydb/core/statistics/aggregator/ut/test-results/unittest/testing_out_stuff
stderr:
/home/runner/actions_runner/_work/ydb/ydb/tmp/out/ydb/core/statistics/aggregator/ut/test-results/unittest/testing_out_stuff/AnalyzeColumnshard.AnalyzeRebootColumnShard.err
stdout:
/home/runner/actions_runner/_work/ydb/ydb/tmp/out/ydb/core/statistics/aggregator/ut/test-results/unittest/testing_out_stuff/AnalyzeColumnshard.AnalyzeRebootColumnShard.out
Status: mute
Date: 14:03 March 22 2025
Info: automatically muted based on rules
SHA: 064d1ba9
Status: mute
Date: 14:03 March 22 2025
Info: automatically muted based on rules
SHA: 79a448f7
Status: mute
Date: 14:03 March 22 2025
Info: automatically muted based on rules
SHA: 064d1ba9
Status: mute
Date: 18:03 March 22 2025
Info: automatically muted based on rules
SHA: 19ace329
Status: mute
Date: 18:03 March 22 2025
Info: automatically muted based on rules
SHA: 19ace329
assertion failed at ydb/core/tx/datashard/ut_common/datashard_ut_common.cpp:2091, void NKikimr::ExecSQL(Tests::TServer::TPtr, TActorId, const TString &, bool, Ydb::StatusIds::StatusCode): (response.GetYdbStatus() == code) failed: (TIMEOUT != SUCCESS) Response {
QueryIssues {
message: "Request timeout 600000ms exceeded"
severity: 1
}
QueryIssues {
message: "Cancelling after 600000ms in ExecuteState"
severity: 1
}
TxMeta {
}
}
YdbStatus: TIMEOUT
, with diff:
(TIM|SUCC)E(OUT|SS)
TBackTrace::Capture() at /-S/util/system/backtrace.cpp:284:14
Get at /-S/util/generic/ptr.h:579:16
~TStringBuilder at /-S/util/string/builder.h:8:11
UnRef at /-S/util/generic/ptr.h:624:13
NKikimr::NTestSuiteIncrementalBackup::TCurrentTest::Execute()::'lambda'()::operator()() const at /-S/ydb/core/tx/datashard/datashard_ut_incremental_backup.cpp:0:1
~__value_func at /-S/contrib/libs/cxxsupp/libcxx/include/__functional/function.h:397:16
UnRef at /-S/util/generic/ptr.h:624:13
NUnitTest::TTestFactory::Execute() at /-S/library/cpp/testing/unittest/registar.cpp:0:19
NUnitTest::RunMain(int, char**) at /-S/library/cpp/testing/unittest/utmain.cpp:0:0
?? at ??:0:0
?? at ??:0:0
_start at ??:0:0
logsdir:
/home/runner/actions_runner/_work/ydb/ydb/tmp/out/ydb/core/tx/datashard/ut_incremental_backup/test-results/unittest/testing_out_stuff
stderr:
/home/runner/actions_runner/_work/ydb/ydb/tmp/out/ydb/core/tx/datashard/ut_incremental_backup/test-results/unittest/testing_out_stuff/IncrementalBackup.ComplexRestoreBackupCollection.WithIncremental.err
stdout:
/home/runner/actions_runner/_work/ydb/ydb/tmp/out/ydb/core/tx/datashard/ut_incremental_backup/test-results/unittest/testing_out_stuff/IncrementalBackup.ComplexRestoreBackupCollection.WithIncremental.out
Status: mute
Date: 14:03 March 22 2025
Info: automatically muted based on rules
SHA: 064d1ba9
Status: mute
Date: 14:03 March 22 2025
Info: automatically muted based on rules
SHA: 79a448f7
Status: mute
Date: 14:03 March 22 2025
Info: automatically muted based on rules
SHA: 064d1ba9
Status: mute
Date: 18:03 March 22 2025
Info: automatically muted based on rules
SHA: 19ace329
Status: mute
Date: 18:03 March 22 2025
Info: automatically muted based on rules
SHA: 19ace329
Test crashed (return code: -6)
See logs for more info
logsdir:
/home/runner/actions_runner/_work/ydb/ydb/tmp/out/ydb/core/tx/tiering/ut/test-results/unittest/testing_out_stuff
stderr:
/home/runner/actions_runner/_work/ydb/ydb/tmp/out/ydb/core/tx/tiering/ut/test-results/unittest/testing_out_stuff/ColumnShardTiers.TTLUsage.err
stdout:
/home/runner/actions_runner/_work/ydb/ydb/tmp/out/ydb/core/tx/tiering/ut/test-results/unittest/testing_out_stuff/ColumnShardTiers.TTLUsage.out
Status: mute
Date: 14:03 March 22 2025
Info: automatically muted based on rules
SHA: 064d1ba9
Status: mute
Date: 14:03 March 22 2025
Info: automatically muted based on rules
SHA: 79a448f7
Status: mute
Date: 14:03 March 22 2025
Info: automatically muted based on rules
SHA: 064d1ba9
Status: mute
Date: 18:03 March 22 2025
Info: automatically muted based on rules
SHA: 19ace329
Status: mute
Date: 18:03 March 22 2025
Info: automatically muted based on rules
SHA: 19ace329
assertion failed at ydb/services/ydb/ydb_logstore_ut.cpp:435, virtual void NTestSuiteYdbLogStore::TTestCaseAlterLogTable::Execute_(NUnitTest::TTestContext &): (res.GetStatus() == EStatus::SUCCESS) failed: (PRECONDITION_FAILED != SUCCESS) <main>: Error: Column stores are not supported
, with diff:
(PRE|SUC)C(ONDITION_FAIL|)E(D|SS)
TBackTrace::Capture() at /-S/util/system/backtrace.cpp:284:14
Get at /-S/util/generic/ptr.h:579:16
~TStringBuilder at /-S/util/string/builder.h:8:11
NTestSuiteYdbLogStore::TCurrentTest::Execute()::'lambda'()::operator()() const at /-S/ydb/services/ydb/ydb_logstore_ut.cpp:0:1
~__value_func at /-S/contrib/libs/cxxsupp/libcxx/include/__functional/function.h:397:16
UnRef at /-S/util/generic/ptr.h:624:13
NUnitTest::TTestFactory::Execute() at /-S/library/cpp/testing/unittest/registar.cpp:0:19
NUnitTest::RunMain(int, char**) at /-S/library/cpp/testing/unittest/utmain.cpp:0:0
?? at ??:0:0
?? at ??:0:0
_start at ??:0:0
logsdir:
/home/runner/actions_runner/_work/ydb/ydb/tmp/out/ydb/services/ydb/ut/test-results/unittest/testing_out_stuff
stderr:
/home/runner/actions_runner/_work/ydb/ydb/tmp/out/ydb/services/ydb/ut/test-results/unittest/testing_out_stuff/YdbLogStore.AlterLogTable.err
stdout:
/home/runner/actions_runner/_work/ydb/ydb/tmp/out/ydb/services/ydb/ut/test-results/unittest/testing_out_stuff/YdbLogStore.AlterLogTable.out
Status: mute
Date: 14:03 March 22 2025
Info: automatically muted based on rules
SHA: 064d1ba9
Status: mute
Date: 14:03 March 22 2025
Info: automatically muted based on rules
SHA: 79a448f7
Status: mute
Date: 14:03 March 22 2025
Info: automatically muted based on rules
SHA: 064d1ba9
Status: mute
Date: 18:03 March 22 2025
Info: automatically muted based on rules
SHA: 19ace329
Status: mute
Date: 18:03 March 22 2025
Info: automatically muted based on rules
SHA: 19ace329
ydb/tests/functional/hive/test_drain.py:93: in test_drain_on_stop
wait_tablets_are_active(
ydb/tests/library/common/delayed.py:151: in wait_tablets_are_active
predicate(raise_error=True)
ydb/tests/library/common/delayed.py:141: in predicate
raise AssertionError(
E AssertionError:
E ##############################
E 0 seconds passed, 38 tablet(s) are not active. Inactive tablets are (first 10 entries): (72075186224037917: 6) (72075186224037996: 6) (72075186224038002: 6) (72075186224038022: 5) (72075186224038024: 6) (72075186224038052: 6) (72075186224038082: 6) (72075186224038098: 6) (72075186224038276: 6) (72075186224038306: 5). Additional info is empty
E ##############################
logsdir:
/home/runner/actions_runner/_work/ydb/ydb/tmp/out/ydb/tests/functional/hive/test-results/py3test/testing_out_stuff
log:
/home/runner/actions_runner/_work/ydb/ydb/tmp/out/ydb/tests/functional/hive/test-results/py3test/testing_out_stuff/test_drain.py.TestHive.test_drain_on_stop.log
Status: mute
Date: 14:03 March 22 2025
Info: automatically muted based on rules
SHA: 064d1ba9
Status: mute
Date: 14:03 March 22 2025
Info: automatically muted based on rules
SHA: 79a448f7
Status: mute
Date: 14:03 March 22 2025
Info: automatically muted based on rules
SHA: 064d1ba9
Status: mute
Date: 18:03 March 22 2025
Info: automatically muted based on rules
SHA: 19ace329
Status: mute
Date: 18:03 March 22 2025
Info: automatically muted based on rules
SHA: 19ace329
Status: mute
Date: 14:03 March 22 2025
Info: automatically muted based on rules
SHA: 064d1ba9
Status: mute
Date: 14:03 March 22 2025
Info: automatically muted based on rules
SHA: 79a448f7
Status: mute
Date: 14:03 March 22 2025
Info: automatically muted based on rules
SHA: 064d1ba9
Status: mute
Date: 18:03 March 22 2025
Info: automatically muted based on rules
SHA: 19ace329
Status: mute
Date: 18:03 March 22 2025
Info: automatically muted based on rules
SHA: 19ace329
ydb/tests/functional/tenants/test_dynamic_tenants.py:350: in test_create_and_drop_the_same_tenant2
pool.retry_operation_sync(write_some_data, None, "table", "table_for_rm", value)
contrib/python/ydb/py3/ydb/table.py:2602: in retry_operation_sync
return retry_operation_sync(wrapped_callee, retry_settings)
contrib/python/ydb/py3/ydb/retries.py:133: in retry_operation_sync
for next_opt in opt_generator:
contrib/python/ydb/py3/ydb/retries.py:94: in retry_operation_impl
result = YdbRetryOperationFinalResult(callee(*args, **kwargs))
contrib/python/ydb/py3/ydb/table.py:2600: in wrapped_callee
return callee(session, *args, **kwargs)
ydb/tests/functional/tenants/test_dynamic_tenants.py:340: in write_some_data
session.transaction().execute(
contrib/python/ydb/py3/ydb/table.py:2339: in execute
return self._driver(
contrib/python/ydb/py3/ydb/tracing.py:70: in wrapper
return f(self, *args, **kwargs)
contrib/python/ydb/py3/ydb/pool.py:443: in __call__
res = connection(
contrib/python/ydb/py3/ydb/connection.py:465: in __call__
return response if wrap_result is None else wrap_result(rpc_state, response, *wrap_args)
contrib/python/ydb/py3/ydb/_session_impl.py:20: in decorator
return func(rpc_state, response_pb, session_state, *args, **kwargs)
contrib/python/ydb/py3/ydb/_tx_ctx_impl.py:9: in decorator
return func(rpc_state, response_pb, session_state, tx_state, *args, **kwargs)
contrib/python/ydb/py3/ydb/_tx_ctx_impl.py:22: in decorator
return func(rpc_state, response_pb, session_state, tx_state, query, *args, **kwargs)
contrib/python/ydb/py3/ydb/_tx_ctx_impl.py:165: in wrap_result_and_tx_id
issues._process_response(response_pb.operation)
contrib/python/ydb/py3/ydb/issues.py:225: in _process_response
raise exc_obj(_format_response(response_proto), response_proto.issues)
E ydb.issues.SchemeError: message: "Failed to create default pool in database /Root/users/database" severity: 1 issues { message: "Failed to create resource pool: StatusPathDoesNotExist" severity: 1 issues { message: "Path does not exist" issue_code: 200200 severity: 1 } } ,message: "Query failed during adding/waiting in workload pool " severity: 1 (server_code: 400070)
logsdir:
/home/runner/actions_runner/_work/ydb/ydb/tmp/out/ydb/tests/functional/tenants/test-results/py3test/testing_out_stuff
log:
/home/runner/actions_runner/_work/ydb/ydb/tmp/out/ydb/tests/functional/tenants/test-results/py3test/testing_out_stuff/test_dynamic_tenants.py.test_create_and_drop_the_same_tenant2.enable_alter_database_create_hive_first--false.log
Status: mute
Date: 14:03 March 22 2025
Info: automatically muted based on rules
SHA: 064d1ba9
Status: mute
Date: 14:03 March 22 2025
Info: automatically muted based on rules
SHA: 79a448f7
Status: mute
Date: 14:03 March 22 2025
Info: automatically muted based on rules
SHA: 064d1ba9
Status: mute
Date: 18:03 March 22 2025
Info: automatically muted based on rules
SHA: 19ace329
Status: mute
Date: 18:03 March 22 2025
Info: automatically muted based on rules
SHA: 19ace329
ydb/tests/functional/tenants/test_dynamic_tenants.py:350: in test_create_and_drop_the_same_tenant2
pool.retry_operation_sync(write_some_data, None, "table", "table_for_rm", value)
contrib/python/ydb/py3/ydb/table.py:2602: in retry_operation_sync
return retry_operation_sync(wrapped_callee, retry_settings)
contrib/python/ydb/py3/ydb/retries.py:133: in retry_operation_sync
for next_opt in opt_generator:
contrib/python/ydb/py3/ydb/retries.py:94: in retry_operation_impl
result = YdbRetryOperationFinalResult(callee(*args, **kwargs))
contrib/python/ydb/py3/ydb/table.py:2600: in wrapped_callee
return callee(session, *args, **kwargs)
ydb/tests/functional/tenants/test_dynamic_tenants.py:340: in write_some_data
session.transaction().execute(
contrib/python/ydb/py3/ydb/table.py:2339: in execute
return self._driver(
contrib/python/ydb/py3/ydb/tracing.py:70: in wrapper
return f(self, *args, **kwargs)
contrib/python/ydb/py3/ydb/pool.py:443: in __call__
res = connection(
contrib/python/ydb/py3/ydb/connection.py:465: in __call__
return response if wrap_result is None else wrap_result(rpc_state, response, *wrap_args)
contrib/python/ydb/py3/ydb/_session_impl.py:20: in decorator
return func(rpc_state, response_pb, session_state, *args, **kwargs)
contrib/python/ydb/py3/ydb/_tx_ctx_impl.py:9: in decorator
return func(rpc_state, response_pb, session_state, tx_state, *args, **kwargs)
contrib/python/ydb/py3/ydb/_tx_ctx_impl.py:22: in decorator
return func(rpc_state, response_pb, session_state, tx_state, query, *args, **kwargs)
contrib/python/ydb/py3/ydb/_tx_ctx_impl.py:165: in wrap_result_and_tx_id
issues._process_response(response_pb.operation)
contrib/python/ydb/py3/ydb/issues.py:225: in _process_response
raise exc_obj(_format_response(response_proto), response_proto.issues)
E ydb.issues.SchemeError: message: "Failed to create default pool in database /Root/users/database" severity: 1 issues { message: "Failed to create resource pool: StatusPathDoesNotExist" severity: 1 issues { message: "Path does not exist" issue_code: 200200 severity: 1 } } ,message: "Query failed during adding/waiting in workload pool " severity: 1 (server_code: 400070)
logsdir:
/home/runner/actions_runner/_work/ydb/ydb/tmp/out/ydb/tests/functional/tenants/test-results/py3test/testing_out_stuff
log:
/home/runner/actions_runner/_work/ydb/ydb/tmp/out/ydb/tests/functional/tenants/test-results/py3test/testing_out_stuff/test_dynamic_tenants.py.test_create_and_drop_the_same_tenant2.enable_alter_database_create_hive_first--true.log
Status: mute
Date: 14:03 March 22 2025
Info: automatically muted based on rules
SHA: 064d1ba9
Status: mute
Date: 14:03 March 22 2025
Info: automatically muted based on rules
SHA: 79a448f7
Status: mute
Date: 14:03 March 22 2025
Info: automatically muted based on rules
SHA: 064d1ba9
Status: mute
Date: 18:03 March 22 2025
Info: automatically muted based on rules
SHA: 19ace329
Status: mute
Date: 18:03 March 22 2025
Info: automatically muted based on rules
SHA: 19ace329
ydb/tests/functional/tenants/test_tenants.py:433: in test_list_database_above
assert result.children[0].name == ".sys"
E AssertionError: assert '.metadata' == '.sys'
E - .sys
E + .metadata
logsdir:
/home/runner/actions_runner/_work/ydb/ydb/tmp/out/ydb/tests/functional/tenants/test-results/py3test/testing_out_stuff
log:
/home/runner/actions_runner/_work/ydb/ydb/tmp/out/ydb/tests/functional/tenants/test-results/py3test/testing_out_stuff/test_tenants.py.TestTenants.test_list_database_above.enable_alter_database_create_hive_first--false.log
Status: mute
Date: 14:03 March 22 2025
Info: automatically muted based on rules
SHA: 064d1ba9
Status: mute
Date: 14:03 March 22 2025
Info: automatically muted based on rules
SHA: 79a448f7
Status: mute
Date: 14:03 March 22 2025
Info: automatically muted based on rules
SHA: 064d1ba9
Status: mute
Date: 18:03 March 22 2025
Info: automatically muted based on rules
SHA: 19ace329
Status: mute
Date: 18:03 March 22 2025
Info: automatically muted based on rules
SHA: 19ace329
ydb/tests/functional/tenants/test_tenants.py:433: in test_list_database_above
assert result.children[0].name == ".sys"
E AssertionError: assert '.metadata' == '.sys'
E - .sys
E + .metadata
logsdir:
/home/runner/actions_runner/_work/ydb/ydb/tmp/out/ydb/tests/functional/tenants/test-results/py3test/testing_out_stuff
log:
/home/runner/actions_runner/_work/ydb/ydb/tmp/out/ydb/tests/functional/tenants/test-results/py3test/testing_out_stuff/test_tenants.py.TestTenants.test_list_database_above.enable_alter_database_create_hive_first--true.log
Status: mute
Date: 14:03 March 22 2025
Info: automatically muted based on rules
SHA: 064d1ba9
Status: mute
Date: 14:03 March 22 2025
Info: automatically muted based on rules
SHA: 79a448f7
Status: mute
Date: 14:03 March 22 2025
Info: automatically muted based on rules
SHA: 064d1ba9
Status: mute
Date: 18:03 March 22 2025
Info: automatically muted based on rules
SHA: 19ace329
Status: mute
Date: 18:03 March 22 2025
Info: automatically muted based on rules
SHA: 19ace329
ydb/tests/functional/tenants/test_tenants.py:297: in test_stop_start
with ydb_database_ctx(ydb_cluster, database_path):
contrib/tools/python3/Lib/contextlib.py:137: in __enter__
return next(self.gen)
ydb/tests/library/fixtures/__init__.py:88: in ydb_database_ctx
ydb_cluster.create_database(database_path, storage_pool_units_count=storage_pools, timeout_seconds=timeout_seconds, token=token)
ydb/tests/library/harness/kikimr_cluster_interface.py:217: in create_database
raise RuntimeError('create_database failed: %s, %s' % (operation.status, ydb.issues._format_issues(operation.issues)))
E RuntimeError: create_database failed: 400080, message: "Group fit error BoxId# 1 StoragePoolId# 5 Error# failed to allocate group: no group options PDisks# {[(1:1-S)]}" severity: 1
logsdir:
/home/runner/actions_runner/_work/ydb/ydb/tmp/out/ydb/tests/functional/tenants/test-results/py3test/testing_out_stuff
log:
/home/runner/actions_runner/_work/ydb/ydb/tmp/out/ydb/tests/functional/tenants/test-results/py3test/testing_out_stuff/test_tenants.py.TestTenants.test_stop_start.enable_alter_database_create_hive_first--false.log
Status: mute
Date: 14:03 March 22 2025
Info: automatically muted based on rules
SHA: 064d1ba9
Status: mute
Date: 14:03 March 22 2025
Info: automatically muted based on rules
SHA: 79a448f7
Status: mute
Date: 14:03 March 22 2025
Info: automatically muted based on rules
SHA: 064d1ba9
Status: mute
Date: 18:03 March 22 2025
Info: automatically muted based on rules
SHA: 19ace329
Status: mute
Date: 18:03 March 22 2025
Info: automatically muted based on rules
SHA: 19ace329
ydb/tests/functional/tenants/test_tenants.py:297: in test_stop_start
with ydb_database_ctx(ydb_cluster, database_path):
contrib/tools/python3/Lib/contextlib.py:137: in __enter__
return next(self.gen)
ydb/tests/library/fixtures/__init__.py:88: in ydb_database_ctx
ydb_cluster.create_database(database_path, storage_pool_units_count=storage_pools, timeout_seconds=timeout_seconds, token=token)
ydb/tests/library/harness/kikimr_cluster_interface.py:217: in create_database
raise RuntimeError('create_database failed: %s, %s' % (operation.status, ydb.issues._format_issues(operation.issues)))
E RuntimeError: create_database failed: 400080, message: "Group fit error BoxId# 1 StoragePoolId# 5 Error# failed to allocate group: no group options PDisks# {[(1:1-S)]}" severity: 1
logsdir:
/home/runner/actions_runner/_work/ydb/ydb/tmp/out/ydb/tests/functional/tenants/test-results/py3test/testing_out_stuff
log:
/home/runner/actions_runner/_work/ydb/ydb/tmp/out/ydb/tests/functional/tenants/test-results/py3test/testing_out_stuff/test_tenants.py.TestTenants.test_stop_start.enable_alter_database_create_hive_first--true.log
Status: mute
Date: 14:03 March 22 2025
Info: automatically muted based on rules
SHA: 064d1ba9
Status: mute
Date: 14:03 March 22 2025
Info: automatically muted based on rules
SHA: 79a448f7
Status: mute
Date: 14:03 March 22 2025
Info: automatically muted based on rules
SHA: 064d1ba9
Status: mute
Date: 18:03 March 22 2025
Info: automatically muted based on rules
SHA: 19ace329
Status: mute
Date: 18:03 March 22 2025
Info: automatically muted based on rules
SHA: 19ace329
ydb/tests/olap/ttl_tiering/ttl_delete_s3.py:202: in test_data_unchanged_after_ttl_change
change_ttl_and_check(self.days_to_cool, days_to_medium, self.days_to_freeze)
ydb/tests/olap/ttl_tiering/ttl_delete_s3.py:195: in change_ttl_and_check
raise Exception("not all data deleted")
E Exception: not all data deleted
logsdir:
/home/runner/actions_runner/_work/ydb/ydb/tmp/out/ydb/tests/olap/ttl_tiering/test-results/py3test/testing_out_stuff
log:
/home/runner/actions_runner/_work/ydb/ydb/tmp/out/ydb/tests/olap/ttl_tiering/test-results/py3test/testing_out_stuff/ttl_delete_s3.py.TestDeleteS3Ttl.test_data_unchanged_after_ttl_change.log
Status: mute
Date: 14:03 March 22 2025
Info: automatically muted based on rules
SHA: 064d1ba9
Status: mute
Date: 14:03 March 22 2025
Info: automatically muted based on rules
SHA: 79a448f7
Status: mute
Date: 14:03 March 22 2025
Info: automatically muted based on rules
SHA: 064d1ba9
Status: mute
Date: 18:03 March 22 2025
Info: automatically muted based on rules
SHA: 19ace329
Status: mute
Date: 18:03 March 22 2025
Info: automatically muted based on rules
SHA: 19ace329
ydb/tests/postgres_integrations/go-libpq/docker_wrapper_test.py:23: in test_pg_generated
tl.execute_test(testname)
ydb/tests/postgres_integrations/library/pytest_integration.py:221: in execute_test
pytest.fail()
E Failed
logsdir:
/home/runner/actions_runner/_work/ydb/ydb/tmp/out/ydb/tests/postgres_integrations/go-libpq/test-results/py3test/testing_out_stuff
log:
/home/runner/actions_runner/_work/ydb/ydb/tmp/out/ydb/tests/postgres_integrations/go-libpq/test-results/py3test/testing_out_stuff/docker_wrapper_test.py.test_pg_generated.TestArrayValueBackend.log
Status: mute
Date: 14:03 March 22 2025
Info: automatically muted based on rules
SHA: 064d1ba9
Status: mute
Date: 14:03 March 22 2025
Info: automatically muted based on rules
SHA: 79a448f7
Status: mute
Date: 14:03 March 22 2025
Info: automatically muted based on rules
SHA: 064d1ba9
Status: mute
Date: 18:03 March 22 2025
Info: automatically muted based on rules
SHA: 19ace329
Status: mute
Date: 18:03 March 22 2025
Info: automatically muted based on rules
SHA: 19ace329
ydb/tests/postgres_integrations/go-libpq/docker_wrapper_test.py:23: in test_pg_generated
tl.execute_test(testname)
ydb/tests/postgres_integrations/library/pytest_integration.py:221: in execute_test
pytest.fail()
E Failed
logsdir:
/home/runner/actions_runner/_work/ydb/ydb/tmp/out/ydb/tests/postgres_integrations/go-libpq/test-results/py3test/testing_out_stuff
log:
/home/runner/actions_runner/_work/ydb/ydb/tmp/out/ydb/tests/postgres_integrations/go-libpq/test-results/py3test/testing_out_stuff/docker_wrapper_test.py.test_pg_generated.TestBinaryByteSliceToInt.log
Status: mute
Date: 14:03 March 22 2025
Info: automatically muted based on rules
SHA: 064d1ba9
Status: mute
Date: 14:03 March 22 2025
Info: automatically muted based on rules
SHA: 79a448f7
Status: mute
Date: 14:03 March 22 2025
Info: automatically muted based on rules
SHA: 064d1ba9
Status: mute
Date: 18:03 March 22 2025
Info: automatically muted based on rules
SHA: 19ace329
Status: mute
Date: 18:03 March 22 2025
Info: automatically muted based on rules
SHA: 19ace329
ydb/tests/postgres_integrations/go-libpq/docker_wrapper_test.py:23: in test_pg_generated
tl.execute_test(testname)
ydb/tests/postgres_integrations/library/pytest_integration.py:221: in execute_test
pytest.fail()
E Failed
logsdir:
/home/runner/actions_runner/_work/ydb/ydb/tmp/out/ydb/tests/postgres_integrations/go-libpq/test-results/py3test/testing_out_stuff
log:
/home/runner/actions_runner/_work/ydb/ydb/tmp/out/ydb/tests/postgres_integrations/go-libpq/test-results/py3test/testing_out_stuff/docker_wrapper_test.py.test_pg_generated.TestBinaryByteSlicetoUUID.log
Status: mute
Date: 14:03 March 22 2025
Info: automatically muted based on rules
SHA: 064d1ba9
Status: mute
Date: 14:03 March 22 2025
Info: automatically muted based on rules
SHA: 79a448f7
Status: mute
Date: 14:03 March 22 2025
Info: automatically muted based on rules
SHA: 064d1ba9
Status: mute
Date: 18:03 March 22 2025
Info: automatically muted based on rules
SHA: 19ace329
Status: mute
Date: 18:03 March 22 2025
Info: automatically muted based on rules
SHA: 19ace329
ydb/tests/postgres_integrations/go-libpq/docker_wrapper_test.py:23: in test_pg_generated
tl.execute_test(testname)
ydb/tests/postgres_integrations/library/pytest_integration.py:221: in execute_test
pytest.fail()
E Failed
logsdir:
/home/runner/actions_runner/_work/ydb/ydb/tmp/out/ydb/tests/postgres_integrations/go-libpq/test-results/py3test/testing_out_stuff
log:
/home/runner/actions_runner/_work/ydb/ydb/tmp/out/ydb/tests/postgres_integrations/go-libpq/test-results/py3test/testing_out_stuff/docker_wrapper_test.py.test_pg_generated.TestBindError.log
Status: mute
Date: 14:03 March 22 2025
Info: automatically muted based on rules
SHA: 064d1ba9
Status: mute
Date: 14:03 March 22 2025
Info: automatically muted based on rules
SHA: 79a448f7
Status: mute
Date: 14:03 March 22 2025
Info: automatically muted based on rules
SHA: 064d1ba9
Status: mute
Date: 18:03 March 22 2025
Info: automatically muted based on rules
SHA: 19ace329
Status: mute
Date: 18:03 March 22 2025
Info: automatically muted based on rules
SHA: 19ace329
ydb/tests/postgres_integrations/go-libpq/docker_wrapper_test.py:23: in test_pg_generated
tl.execute_test(testname)
ydb/tests/postgres_integrations/library/pytest_integration.py:221: in execute_test
pytest.fail()
E Failed
logsdir:
/home/runner/actions_runner/_work/ydb/ydb/tmp/out/ydb/tests/postgres_integrations/go-libpq/test-results/py3test/testing_out_stuff
log:
/home/runner/actions_runner/_work/ydb/ydb/tmp/out/ydb/tests/postgres_integrations/go-libpq/test-results/py3test/testing_out_stuff/docker_wrapper_test.py.test_pg_generated.TestCommit.log
Status: mute
Date: 14:03 March 22 2025
Info: automatically muted based on rules
SHA: 064d1ba9
Status: mute
Date: 14:03 March 22 2025
Info: automatically muted based on rules
SHA: 79a448f7
Status: mute
Date: 14:03 March 22 2025
Info: automatically muted based on rules
SHA: 064d1ba9
Status: mute
Date: 18:03 March 22 2025
Info: automatically muted based on rules
SHA: 19ace329
Status: mute
Date: 18:03 March 22 2025
Info: automatically muted based on rules
SHA: 19ace329
ydb/tests/postgres_integrations/go-libpq/docker_wrapper_test.py:23: in test_pg_generated
tl.execute_test(testname)
ydb/tests/postgres_integrations/library/pytest_integration.py:221: in execute_test
pytest.fail()
E Failed
logsdir:
/home/runner/actions_runner/_work/ydb/ydb/tmp/out/ydb/tests/postgres_integrations/go-libpq/test-results/py3test/testing_out_stuff
log:
/home/runner/actions_runner/_work/ydb/ydb/tmp/out/ydb/tests/postgres_integrations/go-libpq/test-results/py3test/testing_out_stuff/docker_wrapper_test.py.test_pg_generated.TestConnListen.log
Status: mute
Date: 14:03 March 22 2025
Info: automatically muted based on rules
SHA: 064d1ba9
Status: mute
Date: 14:03 March 22 2025
Info: automatically muted based on rules
SHA: 79a448f7
Status: mute
Date: 14:03 March 22 2025
Info: automatically muted based on rules
SHA: 064d1ba9
Status: mute
Date: 18:03 March 22 2025
Info: automatically muted based on rules
SHA: 19ace329
Status: mute
Date: 18:03 March 22 2025
Info: automatically muted based on rules
SHA: 19ace329
ydb/tests/postgres_integrations/go-libpq/docker_wrapper_test.py:23: in test_pg_generated
tl.execute_test(testname)
ydb/tests/postgres_integrations/library/pytest_integration.py:221: in execute_test
pytest.fail()
E Failed
logsdir:
/home/runner/actions_runner/_work/ydb/ydb/tmp/out/ydb/tests/postgres_integrations/go-libpq/test-results/py3test/testing_out_stuff
log:
/home/runner/actions_runner/_work/ydb/ydb/tmp/out/ydb/tests/postgres_integrations/go-libpq/test-results/py3test/testing_out_stuff/docker_wrapper_test.py.test_pg_generated.TestConnPing.log
Status: mute
Date: 14:03 March 22 2025
Info: automatically muted based on rules
SHA: 064d1ba9
Status: mute
Date: 14:03 March 22 2025
Info: automatically muted based on rules
SHA: 79a448f7
Status: mute
Date: 14:03 March 22 2025
Info: automatically muted based on rules
SHA: 064d1ba9
Status: mute
Date: 18:03 March 22 2025
Info: automatically muted based on rules
SHA: 19ace329
Status: mute
Date: 18:03 March 22 2025
Info: automatically muted based on rules
SHA: 19ace329
ydb/tests/postgres_integrations/go-libpq/docker_wrapper_test.py:23: in test_pg_generated
tl.execute_test(testname)
ydb/tests/postgres_integrations/library/pytest_integration.py:221: in execute_test
pytest.fail()
E Failed
logsdir:
/home/runner/actions_runner/_work/ydb/ydb/tmp/out/ydb/tests/postgres_integrations/go-libpq/test-results/py3test/testing_out_stuff
log:
/home/runner/actions_runner/_work/ydb/ydb/tmp/out/ydb/tests/postgres_integrations/go-libpq/test-results/py3test/testing_out_stuff/docker_wrapper_test.py.test_pg_generated.TestConnUnlistenAll.log
Status: mute
Date: 14:03 March 22 2025
Info: automatically muted based on rules
SHA: 064d1ba9
Status: mute
Date: 14:03 March 22 2025
Info: automatically muted based on rules
SHA: 79a448f7
Status: mute
Date: 14:03 March 22 2025
Info: automatically muted based on rules
SHA: 064d1ba9
Status: mute
Date: 18:03 March 22 2025
Info: automatically muted based on rules
SHA: 19ace329
Status: mute
Date: 18:03 March 22 2025
Info: automatically muted based on rules
SHA: 19ace329
ydb/tests/postgres_integrations/go-libpq/docker_wrapper_test.py:23: in test_pg_generated
tl.execute_test(testname)
ydb/tests/postgres_integrations/library/pytest_integration.py:221: in execute_test
pytest.fail()
E Failed
logsdir:
/home/runner/actions_runner/_work/ydb/ydb/tmp/out/ydb/tests/postgres_integrations/go-libpq/test-results/py3test/testing_out_stuff
log:
/home/runner/actions_runner/_work/ydb/ydb/tmp/out/ydb/tests/postgres_integrations/go-libpq/test-results/py3test/testing_out_stuff/docker_wrapper_test.py.test_pg_generated.TestConnUnlisten.log
Status: mute
Date: 14:03 March 22 2025
Info: automatically muted based on rules
SHA: 064d1ba9
Status: mute
Date: 14:03 March 22 2025
Info: automatically muted based on rules
SHA: 79a448f7
Status: mute
Date: 14:03 March 22 2025
Info: automatically muted based on rules
SHA: 064d1ba9
Status: mute
Date: 18:03 March 22 2025
Info: automatically muted based on rules
SHA: 19ace329
Status: mute
Date: 18:03 March 22 2025
Info: automatically muted based on rules
SHA: 19ace329
ydb/tests/postgres_integrations/go-libpq/docker_wrapper_test.py:23: in test_pg_generated
tl.execute_test(testname)
ydb/tests/postgres_integrations/library/pytest_integration.py:221: in execute_test
pytest.fail()
E Failed
logsdir:
/home/runner/actions_runner/_work/ydb/ydb/tmp/out/ydb/tests/postgres_integrations/go-libpq/test-results/py3test/testing_out_stuff
log:
/home/runner/actions_runner/_work/ydb/ydb/tmp/out/ydb/tests/postgres_integrations/go-libpq/test-results/py3test/testing_out_stuff/docker_wrapper_test.py.test_pg_generated.TestConnectorWithNoticeHandler_Simple.log
Status: mute
Date: 14:03 March 22 2025
Info: automatically muted based on rules
SHA: 064d1ba9
Status: mute
Date: 14:03 March 22 2025
Info: automatically muted based on rules
SHA: 79a448f7
Status: mute
Date: 14:03 March 22 2025
Info: automatically muted based on rules
SHA: 064d1ba9
Status: mute
Date: 18:03 March 22 2025
Info: automatically muted based on rules
SHA: 19ace329
Status: mute
Date: 18:03 March 22 2025
Info: automatically muted based on rules
SHA: 19ace329
ydb/tests/postgres_integrations/go-libpq/docker_wrapper_test.py:23: in test_pg_generated
tl.execute_test(testname)
ydb/tests/postgres_integrations/library/pytest_integration.py:221: in execute_test
pytest.fail()
E Failed
logsdir:
/home/runner/actions_runner/_work/ydb/ydb/tmp/out/ydb/tests/postgres_integrations/go-libpq/test-results/py3test/testing_out_stuff
log:
/home/runner/actions_runner/_work/ydb/ydb/tmp/out/ydb/tests/postgres_integrations/go-libpq/test-results/py3test/testing_out_stuff/docker_wrapper_test.py.test_pg_generated.TestConnectorWithNotificationHandler_Simple.log
Status: mute
Date: 14:03 March 22 2025
Info: automatically muted based on rules
SHA: 064d1ba9
Status: mute
Date: 14:03 March 22 2025
Info: automatically muted based on rules
SHA: 79a448f7
Status: mute
Date: 14:03 March 22 2025
Info: automatically muted based on rules
SHA: 064d1ba9
Status: mute
Date: 18:03 March 22 2025
Info: automatically muted based on rules
SHA: 19ace329
Status: mute
Date: 18:03 March 22 2025
Info: automatically muted based on rules
SHA: 19ace329
ydb/tests/postgres_integrations/go-libpq/docker_wrapper_test.py:23: in test_pg_generated
tl.execute_test(testname)
ydb/tests/postgres_integrations/library/pytest_integration.py:221: in execute_test
pytest.fail()
E Failed
logsdir:
/home/runner/actions_runner/_work/ydb/ydb/tmp/out/ydb/tests/postgres_integrations/go-libpq/test-results/py3test/testing_out_stuff
log:
/home/runner/actions_runner/_work/ydb/ydb/tmp/out/ydb/tests/postgres_integrations/go-libpq/test-results/py3test/testing_out_stuff/docker_wrapper_test.py.test_pg_generated.TestContextCancelBegin.log
Status: mute
Date: 14:03 March 22 2025
Info: automatically muted based on rules
SHA: 064d1ba9
Status: mute
Date: 14:03 March 22 2025
Info: automatically muted based on rules
SHA: 79a448f7
Status: mute
Date: 14:03 March 22 2025
Info: automatically muted based on rules
SHA: 064d1ba9
Status: mute
Date: 18:03 March 22 2025
Info: automatically muted based on rules
SHA: 19ace329
Status: mute
Date: 18:03 March 22 2025
Info: automatically muted based on rules
SHA: 19ace329
ydb/tests/postgres_integrations/go-libpq/docker_wrapper_test.py:23: in test_pg_generated
tl.execute_test(testname)
ydb/tests/postgres_integrations/library/pytest_integration.py:221: in execute_test
pytest.fail()
E Failed
logsdir:
/home/runner/actions_runner/_work/ydb/ydb/tmp/out/ydb/tests/postgres_integrations/go-libpq/test-results/py3test/testing_out_stuff
log:
/home/runner/actions_runner/_work/ydb/ydb/tmp/out/ydb/tests/postgres_integrations/go-libpq/test-results/py3test/testing_out_stuff/docker_wrapper_test.py.test_pg_generated.TestCopyFromError.log
Status: mute
Date: 14:03 March 22 2025
Info: automatically muted based on rules
SHA: 064d1ba9
Status: mute
Date: 14:03 March 22 2025
Info: automatically muted based on rules
SHA: 79a448f7
Status: mute
Date: 14:03 March 22 2025
Info: automatically muted based on rules
SHA: 064d1ba9
Status: mute
Date: 18:03 March 22 2025
Info: automatically muted based on rules
SHA: 19ace329
Status: mute
Date: 18:03 March 22 2025
Info: automatically muted based on rules
SHA: 19ace329
ydb/tests/postgres_integrations/go-libpq/docker_wrapper_test.py:23: in test_pg_generated
tl.execute_test(testname)
ydb/tests/postgres_integrations/library/pytest_integration.py:221: in execute_test
pytest.fail()
E Failed
logsdir:
/home/runner/actions_runner/_work/ydb/ydb/tmp/out/ydb/tests/postgres_integrations/go-libpq/test-results/py3test/testing_out_stuff
log:
/home/runner/actions_runner/_work/ydb/ydb/tmp/out/ydb/tests/postgres_integrations/go-libpq/test-results/py3test/testing_out_stuff/docker_wrapper_test.py.test_pg_generated.TestCopyInBinaryError.log
Status: mute
Date: 14:03 March 22 2025
Info: automatically muted based on rules
SHA: 064d1ba9
Status: mute
Date: 14:03 March 22 2025
Info: automatically muted based on rules
SHA: 79a448f7
Status: mute
Date: 14:03 March 22 2025
Info: automatically muted based on rules
SHA: 064d1ba9
Status: mute
Date: 18:03 March 22 2025
Info: automatically muted based on rules
SHA: 19ace329
Status: mute
Date: 18:03 March 22 2025
Info: automatically muted based on rules
SHA: 19ace329
ydb/tests/postgres_integrations/go-libpq/docker_wrapper_test.py:23: in test_pg_generated
tl.execute_test(testname)
ydb/tests/postgres_integrations/library/pytest_integration.py:221: in execute_test
pytest.fail()
E Failed
logsdir:
/home/runner/actions_runner/_work/ydb/ydb/tmp/out/ydb/tests/postgres_integrations/go-libpq/test-results/py3test/testing_out_stuff
log:
/home/runner/actions_runner/_work/ydb/ydb/tmp/out/ydb/tests/postgres_integrations/go-libpq/test-results/py3test/testing_out_stuff/docker_wrapper_test.py.test_pg_generated.TestCopyInMultipleValues.log
Status: mute
Date: 14:03 March 22 2025
Info: automatically muted based on rules
SHA: 064d1ba9
Status: mute
Date: 14:03 March 22 2025
Info: automatically muted based on rules
SHA: 79a448f7
Status: mute
Date: 14:03 March 22 2025
Info: automatically muted based on rules
SHA: 064d1ba9
Status: mute
Date: 18:03 March 22 2025
Info: automatically muted based on rules
SHA: 19ace329
Status: mute
Date: 18:03 March 22 2025
Info: automatically muted based on rules
SHA: 19ace329
ydb/tests/postgres_integrations/go-libpq/docker_wrapper_test.py:23: in test_pg_generated
tl.execute_test(testname)
ydb/tests/postgres_integrations/library/pytest_integration.py:221: in execute_test
pytest.fail()
E Failed
logsdir:
/home/runner/actions_runner/_work/ydb/ydb/tmp/out/ydb/tests/postgres_integrations/go-libpq/test-results/py3test/testing_out_stuff
log:
/home/runner/actions_runner/_work/ydb/ydb/tmp/out/ydb/tests/postgres_integrations/go-libpq/test-results/py3test/testing_out_stuff/docker_wrapper_test.py.test_pg_generated.TestCopyInRaiseStmtTrigger.log
Status: mute
Date: 14:03 March 22 2025
Info: automatically muted based on rules
SHA: 064d1ba9
Status: mute
Date: 14:03 March 22 2025
Info: automatically muted based on rules
SHA: 79a448f7
Status: mute
Date: 14:03 March 22 2025
Info: automatically muted based on rules
SHA: 064d1ba9
Status: mute
Date: 18:03 March 22 2025
Info: automatically muted based on rules
SHA: 19ace329
Status: mute
Date: 18:03 March 22 2025
Info: automatically muted based on rules
SHA: 19ace329
ydb/tests/postgres_integrations/go-libpq/docker_wrapper_test.py:23: in test_pg_generated
tl.execute_test(testname)
ydb/tests/postgres_integrations/library/pytest_integration.py:221: in execute_test
pytest.fail()
E Failed
logsdir:
/home/runner/actions_runner/_work/ydb/ydb/tmp/out/ydb/tests/postgres_integrations/go-libpq/test-results/py3test/testing_out_stuff
log:
/home/runner/actions_runner/_work/ydb/ydb/tmp/out/ydb/tests/postgres_integrations/go-libpq/test-results/py3test/testing_out_stuff/docker_wrapper_test.py.test_pg_generated.TestCopyInStmtAffectedRows.log
Status: mute
Date: 14:03 March 22 2025
Info: automatically muted based on rules
SHA: 064d1ba9
Status: mute
Date: 14:03 March 22 2025
Info: automatically muted based on rules
SHA: 79a448f7
Status: mute
Date: 14:03 March 22 2025
Info: automatically muted based on rules
SHA: 064d1ba9
Status: mute
Date: 18:03 March 22 2025
Info: automatically muted based on rules
SHA: 19ace329
Status: mute
Date: 18:03 March 22 2025
Info: automatically muted based on rules
SHA: 19ace329
ydb/tests/postgres_integrations/go-libpq/docker_wrapper_test.py:23: in test_pg_generated
tl.execute_test(testname)
ydb/tests/postgres_integrations/library/pytest_integration.py:221: in execute_test
pytest.fail()
E Failed
logsdir:
/home/runner/actions_runner/_work/ydb/ydb/tmp/out/ydb/tests/postgres_integrations/go-libpq/test-results/py3test/testing_out_stuff
log:
/home/runner/actions_runner/_work/ydb/ydb/tmp/out/ydb/tests/postgres_integrations/go-libpq/test-results/py3test/testing_out_stuff/docker_wrapper_test.py.test_pg_generated.TestCopyInTypes.log
Status: mute
Date: 14:03 March 22 2025
Info: automatically muted based on rules
SHA: 064d1ba9
Status: mute
Date: 14:03 March 22 2025
Info: automatically muted based on rules
SHA: 79a448f7
Status: mute
Date: 14:03 March 22 2025
Info: automatically muted based on rules
SHA: 064d1ba9
Status: mute
Date: 18:03 March 22 2025
Info: automatically muted based on rules
SHA: 19ace329
Status: mute
Date: 18:03 March 22 2025
Info: automatically muted based on rules
SHA: 19ace329
ydb/tests/postgres_integrations/go-libpq/docker_wrapper_test.py:23: in test_pg_generated
tl.execute_test(testname)
ydb/tests/postgres_integrations/library/pytest_integration.py:221: in execute_test
pytest.fail()
E Failed
logsdir:
/home/runner/actions_runner/_work/ydb/ydb/tmp/out/ydb/tests/postgres_integrations/go-libpq/test-results/py3test/testing_out_stuff
log:
/home/runner/actions_runner/_work/ydb/ydb/tmp/out/ydb/tests/postgres_integrations/go-libpq/test-results/py3test/testing_out_stuff/docker_wrapper_test.py.test_pg_generated.TestCopyInWrongType.log
Status: mute
Date: 14:03 March 22 2025
Info: automatically muted based on rules
SHA: 064d1ba9
Status: mute
Date: 14:03 March 22 2025
Info: automatically muted based on rules
SHA: 79a448f7
Status: mute
Date: 14:03 March 22 2025
Info: automatically muted based on rules
SHA: 064d1ba9
Status: mute
Date: 18:03 March 22 2025
Info: automatically muted based on rules
SHA: 19ace329
Status: mute
Date: 18:03 March 22 2025
Info: automatically muted based on rules
SHA: 19ace329
ydb/tests/postgres_integrations/go-libpq/docker_wrapper_test.py:23: in test_pg_generated
tl.execute_test(testname)
ydb/tests/postgres_integrations/library/pytest_integration.py:221: in execute_test
pytest.fail()
E Failed
logsdir:
/home/runner/actions_runner/_work/ydb/ydb/tmp/out/ydb/tests/postgres_integrations/go-libpq/test-results/py3test/testing_out_stuff
log:
/home/runner/actions_runner/_work/ydb/ydb/tmp/out/ydb/tests/postgres_integrations/go-libpq/test-results/py3test/testing_out_stuff/docker_wrapper_test.py.test_pg_generated.TestCopyRespLoopConnectionError.log
Status: mute
Date: 14:03 March 22 2025
Info: automatically muted based on rules
SHA: 064d1ba9
Status: mute
Date: 14:03 March 22 2025
Info: automatically muted based on rules
SHA: 79a448f7
Status: mute
Date: 14:03 March 22 2025
Info: automatically muted based on rules
SHA: 064d1ba9
Status: mute
Date: 18:03 March 22 2025
Info: automatically muted based on rules
SHA: 19ace329
Status: mute
Date: 18:03 March 22 2025
Info: automatically muted based on rules
SHA: 19ace329
ydb/tests/postgres_integrations/go-libpq/docker_wrapper_test.py:23: in test_pg_generated
tl.execute_test(testname)
ydb/tests/postgres_integrations/library/pytest_integration.py:221: in execute_test
pytest.fail()
E Failed
logsdir:
/home/runner/actions_runner/_work/ydb/ydb/tmp/out/ydb/tests/postgres_integrations/go-libpq/test-results/py3test/testing_out_stuff
log:
/home/runner/actions_runner/_work/ydb/ydb/tmp/out/ydb/tests/postgres_integrations/go-libpq/test-results/py3test/testing_out_stuff/docker_wrapper_test.py.test_pg_generated.TestCopySyntaxError.log
Status: mute
Date: 14:03 March 22 2025
Info: automatically muted based on rules
SHA: 064d1ba9
Status: mute
Date: 14:03 March 22 2025
Info: automatically muted based on rules
SHA: 79a448f7
Status: mute
Date: 14:03 March 22 2025
Info: automatically muted based on rules
SHA: 064d1ba9
Status: mute
Date: 18:03 March 22 2025
Info: automatically muted based on rules
SHA: 19ace329
Status: mute
Date: 18:03 March 22 2025
Info: automatically muted based on rules
SHA: 19ace329
ydb/tests/postgres_integrations/go-libpq/docker_wrapper_test.py:23: in test_pg_generated
tl.execute_test(testname)
ydb/tests/postgres_integrations/library/pytest_integration.py:221: in execute_test
pytest.fail()
E Failed
logsdir:
/home/runner/actions_runner/_work/ydb/ydb/tmp/out/ydb/tests/postgres_integrations/go-libpq/test-results/py3test/testing_out_stuff
log:
/home/runner/actions_runner/_work/ydb/ydb/tmp/out/ydb/tests/postgres_integrations/go-libpq/test-results/py3test/testing_out_stuff/docker_wrapper_test.py.test_pg_generated.TestEmptyQuery.log
Status: mute
Date: 14:03 March 22 2025
Info: automatically muted based on rules
SHA: 064d1ba9
Status: mute
Date: 14:03 March 22 2025
Info: automatically muted based on rules
SHA: 79a448f7
Status: mute
Date: 14:03 March 22 2025
Info: automatically muted based on rules
SHA: 064d1ba9
Status: mute
Date: 18:03 March 22 2025
Info: automatically muted based on rules
SHA: 19ace329
Status: mute
Date: 18:03 March 22 2025
Info: automatically muted based on rules
SHA: 19ace329
ydb/tests/postgres_integrations/go-libpq/docker_wrapper_test.py:23: in test_pg_generated
tl.execute_test(testname)
ydb/tests/postgres_integrations/library/pytest_integration.py:221: in execute_test
pytest.fail()
E Failed
logsdir:
/home/runner/actions_runner/_work/ydb/ydb/tmp/out/ydb/tests/postgres_integrations/go-libpq/test-results/py3test/testing_out_stuff
log:
/home/runner/actions_runner/_work/ydb/ydb/tmp/out/ydb/tests/postgres_integrations/go-libpq/test-results/py3test/testing_out_stuff/docker_wrapper_test.py.test_pg_generated.TestEncodeDecode.log
Status: mute
Date: 14:03 March 22 2025
Info: automatically muted based on rules
SHA: 064d1ba9
Status: mute
Date: 14:03 March 22 2025
Info: automatically muted based on rules
SHA: 79a448f7
Status: mute
Date: 14:03 March 22 2025
Info: automatically muted based on rules
SHA: 064d1ba9
Status: mute
Date: 18:03 March 22 2025
Info: automatically muted based on rules
SHA: 19ace329
Status: mute
Date: 18:03 March 22 2025
Info: automatically muted based on rules
SHA: 19ace329
ydb/tests/postgres_integrations/go-libpq/docker_wrapper_test.py:23: in test_pg_generated
tl.execute_test(testname)
ydb/tests/postgres_integrations/library/pytest_integration.py:221: in execute_test
pytest.fail()
E Failed
logsdir:
/home/runner/actions_runner/_work/ydb/ydb/tmp/out/ydb/tests/postgres_integrations/go-libpq/test-results/py3test/testing_out_stuff
log:
/home/runner/actions_runner/_work/ydb/ydb/tmp/out/ydb/tests/postgres_integrations/go-libpq/test-results/py3test/testing_out_stuff/docker_wrapper_test.py.test_pg_generated.TestErrorClass.log
Status: mute
Date: 14:03 March 22 2025
Info: automatically muted based on rules
SHA: 064d1ba9
Status: mute
Date: 14:03 March 22 2025
Info: automatically muted based on rules
SHA: 79a448f7
Status: mute
Date: 14:03 March 22 2025
Info: automatically muted based on rules
SHA: 064d1ba9
Status: mute
Date: 18:03 March 22 2025
Info: automatically muted based on rules
SHA: 19ace329
Status: mute
Date: 18:03 March 22 2025
Info: automatically muted based on rules
SHA: 19ace329
ydb/tests/postgres_integrations/go-libpq/docker_wrapper_test.py:23: in test_pg_generated
tl.execute_test(testname)
ydb/tests/postgres_integrations/library/pytest_integration.py:221: in execute_test
pytest.fail()
E Failed
logsdir:
/home/runner/actions_runner/_work/ydb/ydb/tmp/out/ydb/tests/postgres_integrations/go-libpq/test-results/py3test/testing_out_stuff
log:
/home/runner/actions_runner/_work/ydb/ydb/tmp/out/ydb/tests/postgres_integrations/go-libpq/test-results/py3test/testing_out_stuff/docker_wrapper_test.py.test_pg_generated.TestErrorDuringStartup.log
Status: mute
Date: 14:03 March 22 2025
Info: automatically muted based on rules
SHA: 064d1ba9
Status: mute
Date: 14:03 March 22 2025
Info: automatically muted based on rules
SHA: 79a448f7
Status: mute
Date: 14:03 March 22 2025
Info: automatically muted based on rules
SHA: 064d1ba9
Status: mute
Date: 18:03 March 22 2025
Info: automatically muted based on rules
SHA: 19ace329
Status: mute
Date: 18:03 March 22 2025
Info: automatically muted based on rules
SHA: 19ace329
ydb/tests/postgres_integrations/go-libpq/docker_wrapper_test.py:23: in test_pg_generated
tl.execute_test(testname)
ydb/tests/postgres_integrations/library/pytest_integration.py:221: in execute_test
pytest.fail()
E Failed
logsdir:
/home/runner/actions_runner/_work/ydb/ydb/tmp/out/ydb/tests/postgres_integrations/go-libpq/test-results/py3test/testing_out_stuff
log:
/home/runner/actions_runner/_work/ydb/ydb/tmp/out/ydb/tests/postgres_integrations/go-libpq/test-results/py3test/testing_out_stuff/docker_wrapper_test.py.test_pg_generated.TestErrorOnExec.log
Status: mute
Date: 14:03 March 22 2025
Info: automatically muted based on rules
SHA: 064d1ba9
Status: mute
Date: 14:03 March 22 2025
Info: automatically muted based on rules
SHA: 79a448f7
Status: mute
Date: 14:03 March 22 2025
Info: automatically muted based on rules
SHA: 064d1ba9
Status: mute
Date: 18:03 March 22 2025
Info: automatically muted based on rules
SHA: 19ace329
Status: mute
Date: 18:03 March 22 2025
Info: automatically muted based on rules
SHA: 19ace329
ydb/tests/postgres_integrations/go-libpq/docker_wrapper_test.py:23: in test_pg_generated
tl.execute_test(testname)
ydb/tests/postgres_integrations/library/pytest_integration.py:221: in execute_test
pytest.fail()
E Failed
logsdir:
/home/runner/actions_runner/_work/ydb/ydb/tmp/out/ydb/tests/postgres_integrations/go-libpq/test-results/py3test/testing_out_stuff
log:
/home/runner/actions_runner/_work/ydb/ydb/tmp/out/ydb/tests/postgres_integrations/go-libpq/test-results/py3test/testing_out_stuff/docker_wrapper_test.py.test_pg_generated.TestErrorOnQueryRowSimpleQuery.log
Status: mute
Date: 14:03 March 22 2025
Info: automatically muted based on rules
SHA: 064d1ba9
Status: mute
Date: 14:03 March 22 2025
Info: automatically muted based on rules
SHA: 79a448f7
Status: mute
Date: 14:03 March 22 2025
Info: automatically muted based on rules
SHA: 064d1ba9
Status: mute
Date: 18:03 March 22 2025
Info: automatically muted based on rules
SHA: 19ace329
Status: mute
Date: 18:03 March 22 2025
Info: automatically muted based on rules
SHA: 19ace329
ydb/tests/postgres_integrations/go-libpq/docker_wrapper_test.py:23: in test_pg_generated
tl.execute_test(testname)
ydb/tests/postgres_integrations/library/pytest_integration.py:221: in execute_test
pytest.fail()
E Failed
logsdir:
/home/runner/actions_runner/_work/ydb/ydb/tmp/out/ydb/tests/postgres_integrations/go-libpq/test-results/py3test/testing_out_stuff
log:
/home/runner/actions_runner/_work/ydb/ydb/tmp/out/ydb/tests/postgres_integrations/go-libpq/test-results/py3test/testing_out_stuff/docker_wrapper_test.py.test_pg_generated.TestErrorOnQuery.log
Status: mute
Date: 14:03 March 22 2025
Info: automatically muted based on rules
SHA: 064d1ba9
Status: mute
Date: 14:03 March 22 2025
Info: automatically muted based on rules
SHA: 79a448f7
Status: mute
Date: 14:03 March 22 2025
Info: automatically muted based on rules
SHA: 064d1ba9
Status: mute
Date: 18:03 March 22 2025
Info: automatically muted based on rules
SHA: 19ace329
Status: mute
Date: 18:03 March 22 2025
Info: automatically muted based on rules
SHA: 19ace329
ydb/tests/postgres_integrations/go-libpq/docker_wrapper_test.py:23: in test_pg_generated
tl.execute_test(testname)
ydb/tests/postgres_integrations/library/pytest_integration.py:221: in execute_test
pytest.fail()
E Failed
logsdir:
/home/runner/actions_runner/_work/ydb/ydb/tmp/out/ydb/tests/postgres_integrations/go-libpq/test-results/py3test/testing_out_stuff
log:
/home/runner/actions_runner/_work/ydb/ydb/tmp/out/ydb/tests/postgres_integrations/go-libpq/test-results/py3test/testing_out_stuff/docker_wrapper_test.py.test_pg_generated.TestExec.log
Status: mute
Date: 14:03 March 22 2025
Info: automatically muted based on rules
SHA: 064d1ba9
Status: mute
Date: 14:03 March 22 2025
Info: automatically muted based on rules
SHA: 79a448f7
Status: mute
Date: 14:03 March 22 2025
Info: automatically muted based on rules
SHA: 064d1ba9
Status: mute
Date: 18:03 March 22 2025
Info: automatically muted based on rules
SHA: 19ace329
Status: mute
Date: 18:03 March 22 2025
Info: automatically muted based on rules
SHA: 19ace329
ydb/tests/postgres_integrations/go-libpq/docker_wrapper_test.py:23: in test_pg_generated
tl.execute_test(testname)
ydb/tests/postgres_integrations/library/pytest_integration.py:221: in execute_test
pytest.fail()
E Failed
logsdir:
/home/runner/actions_runner/_work/ydb/ydb/tmp/out/ydb/tests/postgres_integrations/go-libpq/test-results/py3test/testing_out_stuff
log:
/home/runner/actions_runner/_work/ydb/ydb/tmp/out/ydb/tests/postgres_integrations/go-libpq/test-results/py3test/testing_out_stuff/docker_wrapper_test.py.test_pg_generated.TestFormatTsBackend.log
Status: mute
Date: 14:03 March 22 2025
Info: automatically muted based on rules
SHA: 064d1ba9
Status: mute
Date: 14:03 March 22 2025
Info: automatically muted based on rules
SHA: 79a448f7
Status: mute
Date: 14:03 March 22 2025
Info: automatically muted based on rules
SHA: 064d1ba9
Status: mute
Date: 18:03 March 22 2025
Info: automatically muted based on rules
SHA: 19ace329
Status: mute
Date: 18:03 March 22 2025
Info: automatically muted based on rules
SHA: 19ace329
ydb/tests/postgres_integrations/go-libpq/docker_wrapper_test.py:23: in test_pg_generated
tl.execute_test(testname)
ydb/tests/postgres_integrations/library/pytest_integration.py:221: in execute_test
pytest.fail()
E Failed
logsdir:
/home/runner/actions_runner/_work/ydb/ydb/tmp/out/ydb/tests/postgres_integrations/go-libpq/test-results/py3test/testing_out_stuff
log:
/home/runner/actions_runner/_work/ydb/ydb/tmp/out/ydb/tests/postgres_integrations/go-libpq/test-results/py3test/testing_out_stuff/docker_wrapper_test.py.test_pg_generated.TestHasCorrectRootGroupPermissions.log
Status: mute
Date: 14:03 March 22 2025
Info: automatically muted based on rules
SHA: 064d1ba9
Status: mute
Date: 14:03 March 22 2025
Info: automatically muted based on rules
SHA: 79a448f7
Status: mute
Date: 14:03 March 22 2025
Info: automatically muted based on rules
SHA: 064d1ba9
Status: mute
Date: 18:03 March 22 2025
Info: automatically muted based on rules
SHA: 19ace329
Status: mute
Date: 18:03 March 22 2025
Info: automatically muted based on rules
SHA: 19ace329
ydb/tests/postgres_integrations/go-libpq/docker_wrapper_test.py:23: in test_pg_generated
tl.execute_test(testname)
ydb/tests/postgres_integrations/library/pytest_integration.py:221: in execute_test
pytest.fail()
E Failed
logsdir:
/home/runner/actions_runner/_work/ydb/ydb/tmp/out/ydb/tests/postgres_integrations/go-libpq/test-results/py3test/testing_out_stuff
log:
/home/runner/actions_runner/_work/ydb/ydb/tmp/out/ydb/tests/postgres_integrations/go-libpq/test-results/py3test/testing_out_stuff/docker_wrapper_test.py.test_pg_generated.TestInfinityTimestamp.log
Status: mute
Date: 14:03 March 22 2025
Info: automatically muted based on rules
SHA: 064d1ba9
Status: mute
Date: 14:03 March 22 2025
Info: automatically muted based on rules
SHA: 79a448f7
Status: mute
Date: 14:03 March 22 2025
Info: automatically muted based on rules
SHA: 064d1ba9
Status: mute
Date: 18:03 March 22 2025
Info: automatically muted based on rules
SHA: 19ace329
Status: mute
Date: 18:03 March 22 2025
Info: automatically muted based on rules
SHA: 19ace329
ydb/tests/postgres_integrations/go-libpq/docker_wrapper_test.py:23: in test_pg_generated
tl.execute_test(testname)
ydb/tests/postgres_integrations/library/pytest_integration.py:221: in execute_test
pytest.fail()
E Failed
logsdir:
/home/runner/actions_runner/_work/ydb/ydb/tmp/out/ydb/tests/postgres_integrations/go-libpq/test-results/py3test/testing_out_stuff
log:
/home/runner/actions_runner/_work/ydb/ydb/tmp/out/ydb/tests/postgres_integrations/go-libpq/test-results/py3test/testing_out_stuff/docker_wrapper_test.py.test_pg_generated.TestIssue1046.log
Status: mute
Date: 14:03 March 22 2025
Info: automatically muted based on rules
SHA: 064d1ba9
Status: mute
Date: 14:03 March 22 2025
Info: automatically muted based on rules
SHA: 79a448f7
Status: mute
Date: 14:03 March 22 2025
Info: automatically muted based on rules
SHA: 064d1ba9
Status: mute
Date: 18:03 March 22 2025
Info: automatically muted based on rules
SHA: 19ace329
Status: mute
Date: 18:03 March 22 2025
Info: automatically muted based on rules
SHA: 19ace329
ydb/tests/postgres_integrations/go-libpq/docker_wrapper_test.py:23: in test_pg_generated
tl.execute_test(testname)
ydb/tests/postgres_integrations/library/pytest_integration.py:221: in execute_test
pytest.fail()
E Failed
logsdir:
/home/runner/actions_runner/_work/ydb/ydb/tmp/out/ydb/tests/postgres_integrations/go-libpq/test-results/py3test/testing_out_stuff
log:
/home/runner/actions_runner/_work/ydb/ydb/tmp/out/ydb/tests/postgres_integrations/go-libpq/test-results/py3test/testing_out_stuff/docker_wrapper_test.py.test_pg_generated.TestIssue1062.log
Status: mute
Date: 14:03 March 22 2025
Info: automatically muted based on rules
SHA: 064d1ba9
Status: mute
Date: 14:03 March 22 2025
Info: automatically muted based on rules
SHA: 79a448f7
Status: mute
Date: 14:03 March 22 2025
Info: automatically muted based on rules
SHA: 064d1ba9
Status: mute
Date: 18:03 March 22 2025
Info: automatically muted based on rules
SHA: 19ace329
Status: mute
Date: 18:03 March 22 2025
Info: automatically muted based on rules
SHA: 19ace329
ydb/tests/postgres_integrations/go-libpq/docker_wrapper_test.py:23: in test_pg_generated
tl.execute_test(testname)
ydb/tests/postgres_integrations/library/pytest_integration.py:221: in execute_test
pytest.fail()
E Failed
logsdir:
/home/runner/actions_runner/_work/ydb/ydb/tmp/out/ydb/tests/postgres_integrations/go-libpq/test-results/py3test/testing_out_stuff
log:
/home/runner/actions_runner/_work/ydb/ydb/tmp/out/ydb/tests/postgres_integrations/go-libpq/test-results/py3test/testing_out_stuff/docker_wrapper_test.py.test_pg_generated.TestIssue186.log
Status: mute
Date: 14:03 March 22 2025
Info: automatically muted based on rules
SHA: 064d1ba9
Status: mute
Date: 14:03 March 22 2025
Info: automatically muted based on rules
SHA: 79a448f7
Status: mute
Date: 14:03 March 22 2025
Info: automatically muted based on rules
SHA: 064d1ba9
Status: mute
Date: 18:03 March 22 2025
Info: automatically muted based on rules
SHA: 19ace329
Status: mute
Date: 18:03 March 22 2025
Info: automatically muted based on rules
SHA: 19ace329
ydb/tests/postgres_integrations/go-libpq/docker_wrapper_test.py:23: in test_pg_generated
tl.execute_test(testname)
ydb/tests/postgres_integrations/library/pytest_integration.py:221: in execute_test
pytest.fail()
E Failed
logsdir:
/home/runner/actions_runner/_work/ydb/ydb/tmp/out/ydb/tests/postgres_integrations/go-libpq/test-results/py3test/testing_out_stuff
log:
/home/runner/actions_runner/_work/ydb/ydb/tmp/out/ydb/tests/postgres_integrations/go-libpq/test-results/py3test/testing_out_stuff/docker_wrapper_test.py.test_pg_generated.TestListenerFailedQuery.log
Status: mute
Date: 14:03 March 22 2025
Info: automatically muted based on rules
SHA: 064d1ba9
Status: mute
Date: 14:03 March 22 2025
Info: automatically muted based on rules
SHA: 79a448f7
Status: mute
Date: 14:03 March 22 2025
Info: automatically muted based on rules
SHA: 064d1ba9
Status: mute
Date: 18:03 March 22 2025
Info: automatically muted based on rules
SHA: 19ace329
Status: mute
Date: 18:03 March 22 2025
Info: automatically muted based on rules
SHA: 19ace329
ydb/tests/postgres_integrations/go-libpq/docker_wrapper_test.py:23: in test_pg_generated
tl.execute_test(testname)
ydb/tests/postgres_integrations/library/pytest_integration.py:221: in execute_test
pytest.fail()
E Failed
logsdir:
/home/runner/actions_runner/_work/ydb/ydb/tmp/out/ydb/tests/postgres_integrations/go-libpq/test-results/py3test/testing_out_stuff
log:
/home/runner/actions_runner/_work/ydb/ydb/tmp/out/ydb/tests/postgres_integrations/go-libpq/test-results/py3test/testing_out_stuff/docker_wrapper_test.py.test_pg_generated.TestListenerListen.log
Status: mute
Date: 14:03 March 22 2025
Info: automatically muted based on rules
SHA: 064d1ba9
Status: mute
Date: 14:03 March 22 2025
Info: automatically muted based on rules
SHA: 79a448f7
Status: mute
Date: 14:03 March 22 2025
Info: automatically muted based on rules
SHA: 064d1ba9
Status: mute
Date: 18:03 March 22 2025
Info: automatically muted based on rules
SHA: 19ace329
Status: mute
Date: 18:03 March 22 2025
Info: automatically muted based on rules
SHA: 19ace329
ydb/tests/postgres_integrations/go-libpq/docker_wrapper_test.py:23: in test_pg_generated
tl.execute_test(testname)
ydb/tests/postgres_integrations/library/pytest_integration.py:221: in execute_test
pytest.fail()
E Failed
logsdir:
/home/runner/actions_runner/_work/ydb/ydb/tmp/out/ydb/tests/postgres_integrations/go-libpq/test-results/py3test/testing_out_stuff
log:
/home/runner/actions_runner/_work/ydb/ydb/tmp/out/ydb/tests/postgres_integrations/go-libpq/test-results/py3test/testing_out_stuff/docker_wrapper_test.py.test_pg_generated.TestListenerPing.log
Status: mute
Date: 14:03 March 22 2025
Info: automatically muted based on rules
SHA: 064d1ba9
Status: mute
Date: 14:03 March 22 2025
Info: automatically muted based on rules
SHA: 79a448f7
Status: mute
Date: 14:03 March 22 2025
Info: automatically muted based on rules
SHA: 064d1ba9
Status: mute
Date: 18:03 March 22 2025
Info: automatically muted based on rules
SHA: 19ace329
Status: mute
Date: 18:03 March 22 2025
Info: automatically muted based on rules
SHA: 19ace329
ydb/tests/postgres_integrations/go-libpq/docker_wrapper_test.py:23: in test_pg_generated
tl.execute_test(testname)
ydb/tests/postgres_integrations/library/pytest_integration.py:221: in execute_test
pytest.fail()
E Failed
logsdir:
/home/runner/actions_runner/_work/ydb/ydb/tmp/out/ydb/tests/postgres_integrations/go-libpq/test-results/py3test/testing_out_stuff
log:
/home/runner/actions_runner/_work/ydb/ydb/tmp/out/ydb/tests/postgres_integrations/go-libpq/test-results/py3test/testing_out_stuff/docker_wrapper_test.py.test_pg_generated.TestListenerReconnect.log
Status: mute
Date: 14:03 March 22 2025
Info: automatically muted based on rules
SHA: 064d1ba9
Status: mute
Date: 14:03 March 22 2025
Info: automatically muted based on rules
SHA: 79a448f7
Status: mute
Date: 14:03 March 22 2025
Info: automatically muted based on rules
SHA: 064d1ba9
Status: mute
Date: 18:03 March 22 2025
Info: automatically muted based on rules
SHA: 19ace329
Status: mute
Date: 18:03 March 22 2025
Info: automatically muted based on rules
SHA: 19ace329
ydb/tests/postgres_integrations/go-libpq/docker_wrapper_test.py:23: in test_pg_generated
tl.execute_test(testname)
ydb/tests/postgres_integrations/library/pytest_integration.py:221: in execute_test
pytest.fail()
E Failed
logsdir:
/home/runner/actions_runner/_work/ydb/ydb/tmp/out/ydb/tests/postgres_integrations/go-libpq/test-results/py3test/testing_out_stuff
log:
/home/runner/actions_runner/_work/ydb/ydb/tmp/out/ydb/tests/postgres_integrations/go-libpq/test-results/py3test/testing_out_stuff/docker_wrapper_test.py.test_pg_generated.TestListenerUnlistenAll.log
Status: mute
Date: 14:03 March 22 2025
Info: automatically muted based on rules
SHA: 064d1ba9
Status: mute
Date: 14:03 March 22 2025
Info: automatically muted based on rules
SHA: 79a448f7
Status: mute
Date: 14:03 March 22 2025
Info: automatically muted based on rules
SHA: 064d1ba9
Status: mute
Date: 18:03 March 22 2025
Info: automatically muted based on rules
SHA: 19ace329
Status: mute
Date: 18:03 March 22 2025
Info: automatically muted based on rules
SHA: 19ace329
ydb/tests/postgres_integrations/go-libpq/docker_wrapper_test.py:23: in test_pg_generated
tl.execute_test(testname)
ydb/tests/postgres_integrations/library/pytest_integration.py:221: in execute_test
pytest.fail()
E Failed
logsdir:
/home/runner/actions_runner/_work/ydb/ydb/tmp/out/ydb/tests/postgres_integrations/go-libpq/test-results/py3test/testing_out_stuff
log:
/home/runner/actions_runner/_work/ydb/ydb/tmp/out/ydb/tests/postgres_integrations/go-libpq/test-results/py3test/testing_out_stuff/docker_wrapper_test.py.test_pg_generated.TestListenerUnlisten.log
Status: mute
Date: 14:03 March 22 2025
Info: automatically muted based on rules
SHA: 064d1ba9
Status: mute
Date: 14:03 March 22 2025
Info: automatically muted based on rules
SHA: 79a448f7
Status: mute
Date: 14:03 March 22 2025
Info: automatically muted based on rules
SHA: 064d1ba9
Status: mute
Date: 18:03 March 22 2025
Info: automatically muted based on rules
SHA: 19ace329
Status: mute
Date: 18:03 March 22 2025
Info: automatically muted based on rules
SHA: 19ace329
ydb/tests/postgres_integrations/go-libpq/docker_wrapper_test.py:23: in test_pg_generated
tl.execute_test(testname)
ydb/tests/postgres_integrations/library/pytest_integration.py:221: in execute_test
pytest.fail()
E Failed
logsdir:
/home/runner/actions_runner/_work/ydb/ydb/tmp/out/ydb/tests/postgres_integrations/go-libpq/test-results/py3test/testing_out_stuff
log:
/home/runner/actions_runner/_work/ydb/ydb/tmp/out/ydb/tests/postgres_integrations/go-libpq/test-results/py3test/testing_out_stuff/docker_wrapper_test.py.test_pg_generated.TestNewConnector_Connect.log
Status: mute
Date: 14:03 March 22 2025
Info: automatically muted based on rules
SHA: 064d1ba9
Status: mute
Date: 14:03 March 22 2025
Info: automatically muted based on rules
SHA: 79a448f7
Status: mute
Date: 14:03 March 22 2025
Info: automatically muted based on rules
SHA: 064d1ba9
Status: mute
Date: 18:03 March 22 2025
Info: automatically muted based on rules
SHA: 19ace329
Status: mute
Date: 18:03 March 22 2025
Info: automatically muted based on rules
SHA: 19ace329
ydb/tests/postgres_integrations/go-libpq/docker_wrapper_test.py:23: in test_pg_generated
tl.execute_test(testname)
ydb/tests/postgres_integrations/library/pytest_integration.py:221: in execute_test
pytest.fail()
E Failed
logsdir:
/home/runner/actions_runner/_work/ydb/ydb/tmp/out/ydb/tests/postgres_integrations/go-libpq/test-results/py3test/testing_out_stuff
log:
/home/runner/actions_runner/_work/ydb/ydb/tmp/out/ydb/tests/postgres_integrations/go-libpq/test-results/py3test/testing_out_stuff/docker_wrapper_test.py.test_pg_generated.TestNewConnector_Driver.log
Status: mute
Date: 14:03 March 22 2025
Info: automatically muted based on rules
SHA: 064d1ba9
Status: mute
Date: 14:03 March 22 2025
Info: automatically muted based on rules
SHA: 79a448f7
Status: mute
Date: 14:03 March 22 2025
Info: automatically muted based on rules
SHA: 064d1ba9
Status: mute
Date: 18:03 March 22 2025
Info: automatically muted based on rules
SHA: 19ace329
Status: mute
Date: 18:03 March 22 2025
Info: automatically muted based on rules
SHA: 19ace329
ydb/tests/postgres_integrations/go-libpq/docker_wrapper_test.py:23: in test_pg_generated
tl.execute_test(testname)
ydb/tests/postgres_integrations/library/pytest_integration.py:221: in execute_test
pytest.fail()
E Failed
logsdir:
/home/runner/actions_runner/_work/ydb/ydb/tmp/out/ydb/tests/postgres_integrations/go-libpq/test-results/py3test/testing_out_stuff
log:
/home/runner/actions_runner/_work/ydb/ydb/tmp/out/ydb/tests/postgres_integrations/go-libpq/test-results/py3test/testing_out_stuff/docker_wrapper_test.py.test_pg_generated.TestNewConnector_WorksWithOpenDB.log
Status: mute
Date: 14:03 March 22 2025
Info: automatically muted based on rules
SHA: 064d1ba9
Status: mute
Date: 14:03 March 22 2025
Info: automatically muted based on rules
SHA: 79a448f7
Status: mute
Date: 14:03 March 22 2025
Info: automatically muted based on rules
SHA: 064d1ba9
Status: mute
Date: 18:03 March 22 2025
Info: automatically muted based on rules
SHA: 19ace329
Status: mute
Date: 18:03 March 22 2025
Info: automatically muted based on rules
SHA: 19ace329
ydb/tests/postgres_integrations/go-libpq/docker_wrapper_test.py:23: in test_pg_generated
tl.execute_test(testname)
ydb/tests/postgres_integrations/library/pytest_integration.py:221: in execute_test
pytest.fail()
E Failed
logsdir:
/home/runner/actions_runner/_work/ydb/ydb/tmp/out/ydb/tests/postgres_integrations/go-libpq/test-results/py3test/testing_out_stuff
log:
/home/runner/actions_runner/_work/ydb/ydb/tmp/out/ydb/tests/postgres_integrations/go-libpq/test-results/py3test/testing_out_stuff/docker_wrapper_test.py.test_pg_generated.TestNotifyExtra.log
Status: mute
Date: 14:03 March 22 2025
Info: automatically muted based on rules
SHA: 064d1ba9
Status: mute
Date: 14:03 March 22 2025
Info: automatically muted based on rules
SHA: 79a448f7
Status: mute
Date: 14:03 March 22 2025
Info: automatically muted based on rules
SHA: 064d1ba9
Status: mute
Date: 18:03 March 22 2025
Info: automatically muted based on rules
SHA: 19ace329
Status: mute
Date: 18:03 March 22 2025
Info: automatically muted based on rules
SHA: 19ace329
ydb/tests/postgres_integrations/go-libpq/docker_wrapper_test.py:23: in test_pg_generated
tl.execute_test(testname)
ydb/tests/postgres_integrations/library/pytest_integration.py:221: in execute_test
pytest.fail()
E Failed
logsdir:
/home/runner/actions_runner/_work/ydb/ydb/tmp/out/ydb/tests/postgres_integrations/go-libpq/test-results/py3test/testing_out_stuff
log:
/home/runner/actions_runner/_work/ydb/ydb/tmp/out/ydb/tests/postgres_integrations/go-libpq/test-results/py3test/testing_out_stuff/docker_wrapper_test.py.test_pg_generated.TestNullAfterNonNull.log
Status: mute
Date: 14:03 March 22 2025
Info: automatically muted based on rules
SHA: 064d1ba9
Status: mute
Date: 14:03 March 22 2025
Info: automatically muted based on rules
SHA: 79a448f7
Status: mute
Date: 14:03 March 22 2025
Info: automatically muted based on rules
SHA: 064d1ba9
Status: mute
Date: 18:03 March 22 2025
Info: automatically muted based on rules
SHA: 19ace329
Status: mute
Date: 18:03 March 22 2025
Info: automatically muted based on rules
SHA: 19ace329
ydb/tests/postgres_integrations/go-libpq/docker_wrapper_test.py:23: in test_pg_generated
tl.execute_test(testname)
ydb/tests/postgres_integrations/library/pytest_integration.py:221: in execute_test
pytest.fail()
E Failed
logsdir:
/home/runner/actions_runner/_work/ydb/ydb/tmp/out/ydb/tests/postgres_integrations/go-libpq/test-results/py3test/testing_out_stuff
log:
/home/runner/actions_runner/_work/ydb/ydb/tmp/out/ydb/tests/postgres_integrations/go-libpq/test-results/py3test/testing_out_stuff/docker_wrapper_test.py.test_pg_generated.TestParseErrorInExtendedQuery.log
Status: mute
Date: 14:03 March 22 2025
Info: automatically muted based on rules
SHA: 064d1ba9
Status: mute
Date: 14:03 March 22 2025
Info: automatically muted based on rules
SHA: 79a448f7
Status: mute
Date: 14:03 March 22 2025
Info: automatically muted based on rules
SHA: 064d1ba9
Status: mute
Date: 18:03 March 22 2025
Info: automatically muted based on rules
SHA: 19ace329
Status: mute
Date: 18:03 March 22 2025
Info: automatically muted based on rules
SHA: 19ace329
ydb/tests/postgres_integrations/go-libpq/docker_wrapper_test.py:23: in test_pg_generated
tl.execute_test(testname)
ydb/tests/postgres_integrations/library/pytest_integration.py:221: in execute_test
pytest.fail()
E Failed
logsdir:
/home/runner/actions_runner/_work/ydb/ydb/tmp/out/ydb/tests/postgres_integrations/go-libpq/test-results/py3test/testing_out_stuff
log:
/home/runner/actions_runner/_work/ydb/ydb/tmp/out/ydb/tests/postgres_integrations/go-libpq/test-results/py3test/testing_out_stuff/docker_wrapper_test.py.test_pg_generated.TestPing.log
Status: mute
Date: 14:03 March 22 2025
Info: automatically muted based on rules
SHA: 064d1ba9
Status: mute
Date: 14:03 March 22 2025
Info: automatically muted based on rules
SHA: 79a448f7
Status: mute
Date: 14:03 March 22 2025
Info: automatically muted based on rules
SHA: 064d1ba9
Status: mute
Date: 18:03 March 22 2025
Info: automatically muted based on rules
SHA: 19ace329
Status: mute
Date: 18:03 March 22 2025
Info: automatically muted based on rules
SHA: 19ace329
ydb/tests/postgres_integrations/go-libpq/docker_wrapper_test.py:23: in test_pg_generated
tl.execute_test(testname)
ydb/tests/postgres_integrations/library/pytest_integration.py:221: in execute_test
pytest.fail()
E Failed
logsdir:
/home/runner/actions_runner/_work/ydb/ydb/tmp/out/ydb/tests/postgres_integrations/go-libpq/test-results/py3test/testing_out_stuff
log:
/home/runner/actions_runner/_work/ydb/ydb/tmp/out/ydb/tests/postgres_integrations/go-libpq/test-results/py3test/testing_out_stuff/docker_wrapper_test.py.test_pg_generated.TestQueryCancelledReused.log
Status: mute
Date: 14:03 March 22 2025
Info: automatically muted based on rules
SHA: 064d1ba9
Status: mute
Date: 14:03 March 22 2025
Info: automatically muted based on rules
SHA: 79a448f7
Status: mute
Date: 14:03 March 22 2025
Info: automatically muted based on rules
SHA: 064d1ba9
Status: mute
Date: 18:03 March 22 2025
Info: automatically muted based on rules
SHA: 19ace329
Status: mute
Date: 18:03 March 22 2025
Info: automatically muted based on rules
SHA: 19ace329
ydb/tests/postgres_integrations/go-libpq/docker_wrapper_test.py:23: in test_pg_generated
tl.execute_test(testname)
ydb/tests/postgres_integrations/library/pytest_integration.py:221: in execute_test
pytest.fail()
E Failed
logsdir:
/home/runner/actions_runner/_work/ydb/ydb/tmp/out/ydb/tests/postgres_integrations/go-libpq/test-results/py3test/testing_out_stuff
log:
/home/runner/actions_runner/_work/ydb/ydb/tmp/out/ydb/tests/postgres_integrations/go-libpq/test-results/py3test/testing_out_stuff/docker_wrapper_test.py.test_pg_generated.TestQueryRowBugWorkaround.log
Status: mute
Date: 14:03 March 22 2025
Info: automatically muted based on rules
SHA: 064d1ba9
Status: mute
Date: 14:03 March 22 2025
Info: automatically muted based on rules
SHA: 79a448f7
Status: mute
Date: 14:03 March 22 2025
Info: automatically muted based on rules
SHA: 064d1ba9
Status: mute
Date: 18:03 March 22 2025
Info: automatically muted based on rules
SHA: 19ace329
Status: mute
Date: 18:03 March 22 2025
Info: automatically muted based on rules
SHA: 19ace329
ydb/tests/postgres_integrations/go-libpq/docker_wrapper_test.py:23: in test_pg_generated
tl.execute_test(testname)
ydb/tests/postgres_integrations/library/pytest_integration.py:221: in execute_test
pytest.fail()
E Failed
logsdir:
/home/runner/actions_runner/_work/ydb/ydb/tmp/out/ydb/tests/postgres_integrations/go-libpq/test-results/py3test/testing_out_stuff
log:
/home/runner/actions_runner/_work/ydb/ydb/tmp/out/ydb/tests/postgres_integrations/go-libpq/test-results/py3test/testing_out_stuff/docker_wrapper_test.py.test_pg_generated.TestReconnect.log
Status: mute
Date: 14:03 March 22 2025
Info: automatically muted based on rules
SHA: 064d1ba9
Status: mute
Date: 14:03 March 22 2025
Info: automatically muted based on rules
SHA: 79a448f7
Status: mute
Date: 14:03 March 22 2025
Info: automatically muted based on rules
SHA: 064d1ba9
Status: mute
Date: 18:03 March 22 2025
Info: automatically muted based on rules
SHA: 19ace329
Status: mute
Date: 18:03 March 22 2025
Info: automatically muted based on rules
SHA: 19ace329
ydb/tests/postgres_integrations/go-libpq/docker_wrapper_test.py:23: in test_pg_generated
tl.execute_test(testname)
ydb/tests/postgres_integrations/library/pytest_integration.py:221: in execute_test
pytest.fail()
E Failed
logsdir:
/home/runner/actions_runner/_work/ydb/ydb/tmp/out/ydb/tests/postgres_integrations/go-libpq/test-results/py3test/testing_out_stuff
log:
/home/runner/actions_runner/_work/ydb/ydb/tmp/out/ydb/tests/postgres_integrations/go-libpq/test-results/py3test/testing_out_stuff/docker_wrapper_test.py.test_pg_generated.TestReturning.log
Status: mute
Date: 14:03 March 22 2025
Info: automatically muted based on rules
SHA: 064d1ba9
Status: mute
Date: 14:03 March 22 2025
Info: automatically muted based on rules
SHA: 79a448f7
Status: mute
Date: 14:03 March 22 2025
Info: automatically muted based on rules
SHA: 064d1ba9
Status: mute
Date: 18:03 March 22 2025
Info: automatically muted based on rules
SHA: 19ace329
Status: mute
Date: 18:03 March 22 2025
Info: automatically muted based on rules
SHA: 19ace329
ydb/tests/postgres_integrations/go-libpq/docker_wrapper_test.py:23: in test_pg_generated
tl.execute_test(testname)
ydb/tests/postgres_integrations/library/pytest_integration.py:221: in execute_test
pytest.fail()
E Failed
logsdir:
/home/runner/actions_runner/_work/ydb/ydb/tmp/out/ydb/tests/postgres_integrations/go-libpq/test-results/py3test/testing_out_stuff
log:
/home/runner/actions_runner/_work/ydb/ydb/tmp/out/ydb/tests/postgres_integrations/go-libpq/test-results/py3test/testing_out_stuff/docker_wrapper_test.py.test_pg_generated.TestRowsResultTag.log
Status: mute
Date: 14:03 March 22 2025
Info: automatically muted based on rules
SHA: 064d1ba9
Status: mute
Date: 14:03 March 22 2025
Info: automatically muted based on rules
SHA: 79a448f7
Status: mute
Date: 14:03 March 22 2025
Info: automatically muted based on rules
SHA: 064d1ba9
Status: mute
Date: 18:03 March 22 2025
Info: automatically muted based on rules
SHA: 19ace329
Status: mute
Date: 18:03 March 22 2025
Info: automatically muted based on rules
SHA: 19ace329
ydb/tests/postgres_integrations/go-libpq/docker_wrapper_test.py:23: in test_pg_generated
tl.execute_test(testname)
ydb/tests/postgres_integrations/library/pytest_integration.py:221: in execute_test
pytest.fail()
E Failed
logsdir:
/home/runner/actions_runner/_work/ydb/ydb/tmp/out/ydb/tests/postgres_integrations/go-libpq/test-results/py3test/testing_out_stuff
log:
/home/runner/actions_runner/_work/ydb/ydb/tmp/out/ydb/tests/postgres_integrations/go-libpq/test-results/py3test/testing_out_stuff/docker_wrapper_test.py.test_pg_generated.TestRuntimeParameters.log
Status: mute
Date: 14:03 March 22 2025
Info: automatically muted based on rules
SHA: 064d1ba9
Status: mute
Date: 14:03 March 22 2025
Info: automatically muted based on rules
SHA: 79a448f7
Status: mute
Date: 14:03 March 22 2025
Info: automatically muted based on rules
SHA: 064d1ba9
Status: mute
Date: 18:03 March 22 2025
Info: automatically muted based on rules
SHA: 19ace329
Status: mute
Date: 18:03 March 22 2025
Info: automatically muted based on rules
SHA: 19ace329
ydb/tests/postgres_integrations/go-libpq/docker_wrapper_test.py:23: in test_pg_generated
tl.execute_test(testname)
ydb/tests/postgres_integrations/library/pytest_integration.py:221: in execute_test
pytest.fail()
E Failed
logsdir:
/home/runner/actions_runner/_work/ydb/ydb/tmp/out/ydb/tests/postgres_integrations/go-libpq/test-results/py3test/testing_out_stuff
log:
/home/runner/actions_runner/_work/ydb/ydb/tmp/out/ydb/tests/postgres_integrations/go-libpq/test-results/py3test/testing_out_stuff/docker_wrapper_test.py.test_pg_generated.TestStmtExecContext.context.Background.log
Status: mute
Date: 14:03 March 22 2025
Info: automatically muted based on rules
SHA: 064d1ba9
Status: mute
Date: 14:03 March 22 2025
Info: automatically muted based on rules
SHA: 79a448f7
Status: mute
Date: 14:03 March 22 2025
Info: automatically muted based on rules
SHA: 064d1ba9
Status: mute
Date: 18:03 March 22 2025
Info: automatically muted based on rules
SHA: 19ace329
Status: mute
Date: 18:03 March 22 2025
Info: automatically muted based on rules
SHA: 19ace329
ydb/tests/postgres_integrations/go-libpq/docker_wrapper_test.py:23: in test_pg_generated
tl.execute_test(testname)
ydb/tests/postgres_integrations/library/pytest_integration.py:221: in execute_test
pytest.fail()
E Failed
logsdir:
/home/runner/actions_runner/_work/ydb/ydb/tmp/out/ydb/tests/postgres_integrations/go-libpq/test-results/py3test/testing_out_stuff
log:
/home/runner/actions_runner/_work/ydb/ydb/tmp/out/ydb/tests/postgres_integrations/go-libpq/test-results/py3test/testing_out_stuff/docker_wrapper_test.py.test_pg_generated.TestStmtExecContext.context.WithTimeout.log
Status: mute
Date: 14:03 March 22 2025
Info: automatically muted based on rules
SHA: 064d1ba9
Status: mute
Date: 14:03 March 22 2025
Info: automatically muted based on rules
SHA: 79a448f7
Status: mute
Date: 14:03 March 22 2025
Info: automatically muted based on rules
SHA: 064d1ba9
Status: mute
Date: 18:03 March 22 2025
Info: automatically muted based on rules
SHA: 19ace329
Status: mute
Date: 18:03 March 22 2025
Info: automatically muted based on rules
SHA: 19ace329
ydb/tests/postgres_integrations/go-libpq/docker_wrapper_test.py:23: in test_pg_generated
tl.execute_test(testname)
ydb/tests/postgres_integrations/library/pytest_integration.py:221: in execute_test
pytest.fail()
E Failed
logsdir:
/home/runner/actions_runner/_work/ydb/ydb/tmp/out/ydb/tests/postgres_integrations/go-libpq/test-results/py3test/testing_out_stuff
log:
/home/runner/actions_runner/_work/ydb/ydb/tmp/out/ydb/tests/postgres_integrations/go-libpq/test-results/py3test/testing_out_stuff/docker_wrapper_test.py.test_pg_generated.TestStmtExecContext.context.WithTimeout_exceeded.log
Status: mute
Date: 14:03 March 22 2025
Info: automatically muted based on rules
SHA: 064d1ba9
Status: mute
Date: 14:03 March 22 2025
Info: automatically muted based on rules
SHA: 79a448f7
Status: mute
Date: 14:03 March 22 2025
Info: automatically muted based on rules
SHA: 064d1ba9
Status: mute
Date: 18:03 March 22 2025
Info: automatically muted based on rules
SHA: 19ace329
Status: mute
Date: 18:03 March 22 2025
Info: automatically muted based on rules
SHA: 19ace329
ydb/tests/postgres_integrations/go-libpq/docker_wrapper_test.py:23: in test_pg_generated
tl.execute_test(testname)
ydb/tests/postgres_integrations/library/pytest_integration.py:221: in execute_test
pytest.fail()
E Failed
logsdir:
/home/runner/actions_runner/_work/ydb/ydb/tmp/out/ydb/tests/postgres_integrations/go-libpq/test-results/py3test/testing_out_stuff
log:
/home/runner/actions_runner/_work/ydb/ydb/tmp/out/ydb/tests/postgres_integrations/go-libpq/test-results/py3test/testing_out_stuff/docker_wrapper_test.py.test_pg_generated.TestStmtExecContext.log
Status: mute
Date: 14:03 March 22 2025
Info: automatically muted based on rules
SHA: 064d1ba9
Status: mute
Date: 14:03 March 22 2025
Info: automatically muted based on rules
SHA: 79a448f7
Status: mute
Date: 14:03 March 22 2025
Info: automatically muted based on rules
SHA: 064d1ba9
Status: mute
Date: 18:03 March 22 2025
Info: automatically muted based on rules
SHA: 19ace329
Status: mute
Date: 18:03 March 22 2025
Info: automatically muted based on rules
SHA: 19ace329
ydb/tests/postgres_integrations/go-libpq/docker_wrapper_test.py:23: in test_pg_generated
tl.execute_test(testname)
ydb/tests/postgres_integrations/library/pytest_integration.py:221: in execute_test
pytest.fail()
E Failed
logsdir:
/home/runner/actions_runner/_work/ydb/ydb/tmp/out/ydb/tests/postgres_integrations/go-libpq/test-results/py3test/testing_out_stuff
log:
/home/runner/actions_runner/_work/ydb/ydb/tmp/out/ydb/tests/postgres_integrations/go-libpq/test-results/py3test/testing_out_stuff/docker_wrapper_test.py.test_pg_generated.TestStmtQueryContext.context.Background.log
Status: mute
Date: 14:03 March 22 2025
Info: automatically muted based on rules
SHA: 064d1ba9
Status: mute
Date: 14:03 March 22 2025
Info: automatically muted based on rules
SHA: 79a448f7
Status: mute
Date: 14:03 March 22 2025
Info: automatically muted based on rules
SHA: 064d1ba9
Status: mute
Date: 18:03 March 22 2025
Info: automatically muted based on rules
SHA: 19ace329
Status: mute
Date: 18:03 March 22 2025
Info: automatically muted based on rules
SHA: 19ace329
ydb/tests/postgres_integrations/go-libpq/docker_wrapper_test.py:23: in test_pg_generated
tl.execute_test(testname)
ydb/tests/postgres_integrations/library/pytest_integration.py:221: in execute_test
pytest.fail()
E Failed
logsdir:
/home/runner/actions_runner/_work/ydb/ydb/tmp/out/ydb/tests/postgres_integrations/go-libpq/test-results/py3test/testing_out_stuff
log:
/home/runner/actions_runner/_work/ydb/ydb/tmp/out/ydb/tests/postgres_integrations/go-libpq/test-results/py3test/testing_out_stuff/docker_wrapper_test.py.test_pg_generated.TestStmtQueryContext.context.WithTimeout.log
Status: mute
Date: 14:03 March 22 2025
Info: automatically muted based on rules
SHA: 064d1ba9
Status: mute
Date: 14:03 March 22 2025
Info: automatically muted based on rules
SHA: 79a448f7
Status: mute
Date: 14:03 March 22 2025
Info: automatically muted based on rules
SHA: 064d1ba9
Status: mute
Date: 18:03 March 22 2025
Info: automatically muted based on rules
SHA: 19ace329
Status: mute
Date: 18:03 March 22 2025
Info: automatically muted based on rules
SHA: 19ace329
ydb/tests/postgres_integrations/go-libpq/docker_wrapper_test.py:23: in test_pg_generated
tl.execute_test(testname)
ydb/tests/postgres_integrations/library/pytest_integration.py:221: in execute_test
pytest.fail()
E Failed
logsdir:
/home/runner/actions_runner/_work/ydb/ydb/tmp/out/ydb/tests/postgres_integrations/go-libpq/test-results/py3test/testing_out_stuff
log:
/home/runner/actions_runner/_work/ydb/ydb/tmp/out/ydb/tests/postgres_integrations/go-libpq/test-results/py3test/testing_out_stuff/docker_wrapper_test.py.test_pg_generated.TestStmtQueryContext.context.WithTimeout_exceeded.log
Status: mute
Date: 14:03 March 22 2025
Info: automatically muted based on rules
SHA: 064d1ba9
Status: mute
Date: 14:03 March 22 2025
Info: automatically muted based on rules
SHA: 79a448f7
Status: mute
Date: 14:03 March 22 2025
Info: automatically muted based on rules
SHA: 064d1ba9
Status: mute
Date: 18:03 March 22 2025
Info: automatically muted based on rules
SHA: 19ace329
Status: mute
Date: 18:03 March 22 2025
Info: automatically muted based on rules
SHA: 19ace329
ydb/tests/postgres_integrations/go-libpq/docker_wrapper_test.py:23: in test_pg_generated
tl.execute_test(testname)
ydb/tests/postgres_integrations/library/pytest_integration.py:221: in execute_test
pytest.fail()
E Failed
logsdir:
/home/runner/actions_runner/_work/ydb/ydb/tmp/out/ydb/tests/postgres_integrations/go-libpq/test-results/py3test/testing_out_stuff
log:
/home/runner/actions_runner/_work/ydb/ydb/tmp/out/ydb/tests/postgres_integrations/go-libpq/test-results/py3test/testing_out_stuff/docker_wrapper_test.py.test_pg_generated.TestStmtQueryContext.log
Status: mute
Date: 14:03 March 22 2025
Info: automatically muted based on rules
SHA: 064d1ba9
Status: mute
Date: 14:03 March 22 2025
Info: automatically muted based on rules
SHA: 79a448f7
Status: mute
Date: 14:03 March 22 2025
Info: automatically muted based on rules
SHA: 064d1ba9
Status: mute
Date: 18:03 March 22 2025
Info: automatically muted based on rules
SHA: 19ace329
Status: mute
Date: 18:03 March 22 2025
Info: automatically muted based on rules
SHA: 19ace329
ydb/tests/postgres_integrations/go-libpq/docker_wrapper_test.py:23: in test_pg_generated
tl.execute_test(testname)
ydb/tests/postgres_integrations/library/pytest_integration.py:221: in execute_test
pytest.fail()
E Failed
logsdir:
/home/runner/actions_runner/_work/ydb/ydb/tmp/out/ydb/tests/postgres_integrations/go-libpq/test-results/py3test/testing_out_stuff
log:
/home/runner/actions_runner/_work/ydb/ydb/tmp/out/ydb/tests/postgres_integrations/go-libpq/test-results/py3test/testing_out_stuff/docker_wrapper_test.py.test_pg_generated.TestStringWithNul.log
Status: mute
Date: 14:03 March 22 2025
Info: automatically muted based on rules
SHA: 064d1ba9
Status: mute
Date: 14:03 March 22 2025
Info: automatically muted based on rules
SHA: 79a448f7
Status: mute
Date: 14:03 March 22 2025
Info: automatically muted based on rules
SHA: 064d1ba9
Status: mute
Date: 18:03 March 22 2025
Info: automatically muted based on rules
SHA: 19ace329
Status: mute
Date: 18:03 March 22 2025
Info: automatically muted based on rules
SHA: 19ace329
ydb/tests/postgres_integrations/go-libpq/docker_wrapper_test.py:23: in test_pg_generated
tl.execute_test(testname)
ydb/tests/postgres_integrations/library/pytest_integration.py:221: in execute_test
pytest.fail()
E Failed
logsdir:
/home/runner/actions_runner/_work/ydb/ydb/tmp/out/ydb/tests/postgres_integrations/go-libpq/test-results/py3test/testing_out_stuff
log:
/home/runner/actions_runner/_work/ydb/ydb/tmp/out/ydb/tests/postgres_integrations/go-libpq/test-results/py3test/testing_out_stuff/docker_wrapper_test.py.test_pg_generated.TestTimestampWithTimeZone.log
Status: mute
Date: 14:03 March 22 2025
Info: automatically muted based on rules
SHA: 064d1ba9
Status: mute
Date: 14:03 March 22 2025
Info: automatically muted based on rules
SHA: 79a448f7
Status: mute
Date: 14:03 March 22 2025
Info: automatically muted based on rules
SHA: 064d1ba9
Status: mute
Date: 18:03 March 22 2025
Info: automatically muted based on rules
SHA: 19ace329
Status: mute
Date: 18:03 March 22 2025
Info: automatically muted based on rules
SHA: 19ace329
ydb/tests/postgres_integrations/go-libpq/docker_wrapper_test.py:23: in test_pg_generated
tl.execute_test(testname)
ydb/tests/postgres_integrations/library/pytest_integration.py:221: in execute_test
pytest.fail()
E Failed
logsdir:
/home/runner/actions_runner/_work/ydb/ydb/tmp/out/ydb/tests/postgres_integrations/go-libpq/test-results/py3test/testing_out_stuff
log:
/home/runner/actions_runner/_work/ydb/ydb/tmp/out/ydb/tests/postgres_integrations/go-libpq/test-results/py3test/testing_out_stuff/docker_wrapper_test.py.test_pg_generated.TestTxOptions.log
Status: mute
Date: 14:03 March 22 2025
Info: automatically muted based on rules
SHA: 064d1ba9
Status: mute
Date: 14:03 March 22 2025
Info: automatically muted based on rules
SHA: 79a448f7
Status: mute
Date: 14:03 March 22 2025
Info: automatically muted based on rules
SHA: 064d1ba9
Status: mute
Date: 18:03 March 22 2025
Info: automatically muted based on rules
SHA: 19ace329
Status: mute
Date: 18:03 March 22 2025
Info: automatically muted based on rules
SHA: 19ace329